Build 46135

Drydock: Build

When
Completed at Jun 28 2018, 1:27 AM · Built for 1 h, 18 m
Status
Failed

Build Log 280616 (remote - stderr)
25 - 50 - 100 - Unlimited Lines

637C:\msys64\var\drydock\workingcopy-121273\repo\glasgow-haskell-compiler\inplace\mingw\bin\ar.exe: creating libraries/random/dist-install/build/libHSrandom-1.1.a
638Warning: include-dirs: C:\msys64\var\drydock\workingcopy-121273\repo\glasgow-haskell-compiler\compiler\stage2\build\utils doesn't exist or isn't a directory
639Warning: include-dirs: C:\msys64\var\drydock\workingcopy-121273\repo\glasgow-haskell-compiler\compiler\stage2\build\../rts/dist/build doesn't exist or isn't a directory
640Warning: include-dirs: C:\msys64\var\drydock\workingcopy-121273\repo\glasgow-haskell-compiler\compiler\stage2\build\stage2 doesn't exist or isn't a directory
641Warning: include-dirs: C:\msys64\var\drydock\workingcopy-121273\repo\glasgow-haskell-compiler\libraries\haskeline\dist-install\build\includes doesn't exist or isn't a directory
642Warning: include-dirs: C:\msys64\var\drydock\workingcopy-121273\repo\glasgow-haskell-compiler\libraries\text\dist-install\build\include doesn't exist or isn't a directory
643Warning: include-dirs: C:\msys64\var\drydock\workingcopy-121273\repo\glasgow-haskell-compiler\libraries\Win32\dist-install\build\include doesn't exist or isn't a directory
644Warning: include-dirs: C:\msys64\var\drydock\workingcopy-121273\repo\glasgow-haskell-compiler\libraries\containers\dist-install\build\include doesn't exist or isn't a directory
645Warning: include-dirs: C:\msys64\var\drydock\workingcopy-121273\repo\glasgow-haskell-compiler\libraries\bytestring\dist-install\build\include doesn't exist or isn't a directory
646rts-1.0: Warning: .:479:1: The field "hugs-options" is deprecated. hugs isn't supported anymore
647ghc-cabal.exe:
648'C:/msys64/var/drydock/workingcopy-121273/repo/glasgow-haskell-compiler/bindistprep/ghc-8.5.20180522/bin/ghc.exe'
649exited with an error:
650ghc.exe: internal error: evacuate: strange closure type 0
651(GHC version 8.5.20180522 for x86_64_unknown_mingw32)
652Please report this as a GHC bug: http://www.haskell.org/ghc/reportabug
653
654This application has requested the Runtime to terminate it in an unusual way.
655Please contact the application's support team for more information.
656
657make[3]: *** [ghc.mk:1004: install_packages] Error 1
658make[2]: *** [Makefile:127: install] Error 2
659make[1]: *** [ghc.mk:1127: windows-binary-dist-prep] Error 2
660make: *** [Makefile:145: binary-dist-prep] Error 2
661

Build Log 280615 (remote - stdout)
25 - 50 - 100 - Unlimited Lines

7064Installing library in C:/msys64/var/drydock/workingcopy-121273/repo/glasgow-haskell-compiler/bindistprep/ghc-8.5.20180522/lib\process-1.6.3.0
7065Installing library in C:/msys64/var/drydock/workingcopy-121273/repo/glasgow-haskell-compiler/bindistprep/ghc-8.5.20180522/lib\hpc-0.6.0.3
7066Installing library in C:/msys64/var/drydock/workingcopy-121273/repo/glasgow-haskell-compiler/bindistprep/ghc-8.5.20180522/lib\pretty-1.1.3.6
7067Installing library in C:/msys64/var/drydock/workingcopy-121273/repo/glasgow-haskell-compiler/bindistprep/ghc-8.5.20180522/lib\binary-0.8.5.1
7068Installing library in C:/msys64/var/drydock/workingcopy-121273/repo/glasgow-haskell-compiler/bindistprep/ghc-8.5.20180522/lib\text-1.2.3.0
7069Installing library in C:/msys64/var/drydock/workingcopy-121273/repo/glasgow-haskell-compiler/bindistprep/ghc-8.5.20180522/lib\transformers-0.5.5.0
7070Installing library in C:/msys64/var/drydock/workingcopy-121273/repo/glasgow-haskell-compiler/bindistprep/ghc-8.5.20180522/lib\mtl-2.2.2
7071Installing library in C:/msys64/var/drydock/workingcopy-121273/repo/glasgow-haskell-compiler/bindistprep/ghc-8.5.20180522/lib\parsec-3.1.13.0.0.0.0.0
7072Installing library in C:/msys64/var/drydock/workingcopy-121273/repo/glasgow-haskell-compiler/bindistprep/ghc-8.5.20180522/lib\Cabal-2.3.0.0
7073Installing library in C:/msys64/var/drydock/workingcopy-121273/repo/glasgow-haskell-compiler/bindistprep/ghc-8.5.20180522/lib\ghc-boot-th-8.5
7074Installing library in C:/msys64/var/drydock/workingcopy-121273/repo/glasgow-haskell-compiler/bindistprep/ghc-8.5.20180522/lib\ghc-boot-8.5
7075Installing library in C:/msys64/var/drydock/workingcopy-121273/repo/glasgow-haskell-compiler/bindistprep/ghc-8.5.20180522/lib\template-haskell-2.14.0.0
7076Installing library in C:/msys64/var/drydock/workingcopy-121273/repo/glasgow-haskell-compiler/bindistprep/ghc-8.5.20180522/lib\ghc-compact-0.1.0.0
7077Installing library in C:/msys64/var/drydock/workingcopy-121273/repo/glasgow-haskell-compiler/bindistprep/ghc-8.5.20180522/lib\ghc-heap-8.5
7078Installing library in C:/msys64/var/drydock/workingcopy-121273/repo/glasgow-haskell-compiler/bindistprep/ghc-8.5.20180522/lib\xhtml-3000.2.2
7079Installing library in C:/msys64/var/drydock/workingcopy-121273/repo/glasgow-haskell-compiler/bindistprep/ghc-8.5.20180522/lib\stm-2.4.5.0
7080Installing library in C:/msys64/var/drydock/workingcopy-121273/repo/glasgow-haskell-compiler/bindistprep/ghc-8.5.20180522/lib\haskeline-0.7.4.2
7081Installing library in C:/msys64/var/drydock/workingcopy-121273/repo/glasgow-haskell-compiler/bindistprep/ghc-8.5.20180522/lib\ghci-8.5
7082Installing library in C:/msys64/var/drydock/workingcopy-121273/repo/glasgow-haskell-compiler/bindistprep/ghc-8.5.20180522/lib\ghc-8.5
7083Installing library in C:/msys64/var/drydock/workingcopy-121273/repo/glasgow-haskell-compiler/bindistprep/ghc-8.5.20180522/lib\parallel-3.2.1.1
7084Installing library in C:/msys64/var/drydock/workingcopy-121273/repo/glasgow-haskell-compiler/bindistprep/ghc-8.5.20180522/lib\random-1.1
7085Reading package info from "rts/dist/package.conf.install" ... done.
7086Registering library for ghc-prim-0.5.3..
7087Registering library for integer-gmp-1.0.2.0..
7088

Drydock: Prepare tree

When
Completed at Jun 28 2018, 12:08 AM · Built for 49 s
Status
Passed

Build Log 280614 (remote - stderr)
25 - 50 - 100 - Unlimited Lines

1+ git clean -qxfd
2+ git submodule foreach git checkout .
3+ git submodule foreach git clean -qxfd
4+ git submodule sync
5+ git submodule update --init --recursive
6+ git submodule foreach -q git clean -qxfd
7

Build Log 280613 (remote - stdout)
25 - 50 - 100 - Unlimited Lines

80Synchronizing submodule url for 'libraries/filepath'
81Synchronizing submodule url for 'libraries/haskeline'
82Synchronizing submodule url for 'libraries/hpc'
83Synchronizing submodule url for 'libraries/integer-gmp/gmp/gmp-tarballs'
84Synchronizing submodule url for 'libraries/mtl'
85Synchronizing submodule url for 'libraries/parallel'
86Synchronizing submodule url for 'libraries/parsec'
87Synchronizing submodule url for 'libraries/pretty'
88Synchronizing submodule url for 'libraries/primitive'
89Synchronizing submodule url for 'libraries/process'
90Synchronizing submodule url for 'libraries/random'
91Synchronizing submodule url for 'libraries/stm'
92Synchronizing submodule url for 'libraries/terminfo'
93Synchronizing submodule url for 'libraries/text'
94Synchronizing submodule url for 'libraries/time'
95Synchronizing submodule url for 'libraries/transformers'
96Synchronizing submodule url for 'libraries/unix'
97Synchronizing submodule url for 'libraries/vector'
98Synchronizing submodule url for 'libraries/xhtml'
99Synchronizing submodule url for 'nofib'
100Synchronizing submodule url for 'utils/haddock'
101Synchronizing submodule url for 'utils/hsc2hs'
102Submodule path 'libraries/stm': checked out '33a36c33de150f562a98803e2fc332f07bb29457'
103Submodule path 'utils/haddock': checked out '46ff2306f580c44915a6f3adb652f02b7f4edfe9'
104

Lease Working Copy

When
Completed at Jun 28 2018, 12:08 AM · Built for 5 w, 1 d
Status
Passed