Build 46047

Drydock: Build

When
Completed at Jun 2 2018, 12:49 AM · Built for 1 h, 22 m
Status
Failed

Build Log 272345 (remote - stderr)
25 - 50 - 100 - Unlimited Lines

673C:\msys64\var\drydock\workingcopy-121273\repo\glasgow-haskell-compiler\inplace\mingw\bin\ar.exe: creating libraries/random/dist-install/build/libHSrandom-1.1.a
674Warning: include-dirs: C:\msys64\var\drydock\workingcopy-121273\repo\glasgow-haskell-compiler\compiler\stage2\build\utils doesn't exist or isn't a directory
675Warning: include-dirs: C:\msys64\var\drydock\workingcopy-121273\repo\glasgow-haskell-compiler\compiler\stage2\build\../rts/dist/build doesn't exist or isn't a directory
676Warning: include-dirs: C:\msys64\var\drydock\workingcopy-121273\repo\glasgow-haskell-compiler\compiler\stage2\build\stage2 doesn't exist or isn't a directory
677Warning: include-dirs: C:\msys64\var\drydock\workingcopy-121273\repo\glasgow-haskell-compiler\libraries\haskeline\dist-install\build\includes doesn't exist or isn't a directory
678Warning: include-dirs: C:\msys64\var\drydock\workingcopy-121273\repo\glasgow-haskell-compiler\libraries\text\dist-install\build\include doesn't exist or isn't a directory
679Warning: include-dirs: C:\msys64\var\drydock\workingcopy-121273\repo\glasgow-haskell-compiler\libraries\Win32\dist-install\build\include doesn't exist or isn't a directory
680Warning: include-dirs: C:\msys64\var\drydock\workingcopy-121273\repo\glasgow-haskell-compiler\libraries\containers\dist-install\build\include doesn't exist or isn't a directory
681Warning: include-dirs: C:\msys64\var\drydock\workingcopy-121273\repo\glasgow-haskell-compiler\libraries\bytestring\dist-install\build\include doesn't exist or isn't a directory
682rts-1.0: Warning: .:479:1: The field "hugs-options" is deprecated. hugs isn't supported anymore
683ghc-cabal.exe:
684'C:/msys64/var/drydock/workingcopy-121273/repo/glasgow-haskell-compiler/bindistprep/ghc-8.5.20180519/bin/ghc.exe'
685exited with an error:
686ghc.exe: internal error: evacuate: strange closure type 910
687(GHC version 8.5.20180519 for x86_64_unknown_mingw32)
688Please report this as a GHC bug: http://www.haskell.org/ghc/reportabug
689
690This application has requested the Runtime to terminate it in an unusual way.
691Please contact the application's support team for more information.
692
693make[3]: *** [ghc.mk:1003: install_packages] Error 1
694make[2]: *** [Makefile:127: install] Error 2
695make[1]: *** [ghc.mk:1126: windows-binary-dist-prep] Error 2
696make: *** [Makefile:145: binary-dist-prep] Error 2
697

Build Log 272344 (remote - stdout)
25 - 50 - 100 - Unlimited Lines

7011Installing library in C:/msys64/var/drydock/workingcopy-121273/repo/glasgow-haskell-compiler/bindistprep/ghc-8.5.20180519/lib\directory-1.3.2.3
7012Installing library in C:/msys64/var/drydock/workingcopy-121273/repo/glasgow-haskell-compiler/bindistprep/ghc-8.5.20180519/lib\process-1.6.3.0
7013Installing library in C:/msys64/var/drydock/workingcopy-121273/repo/glasgow-haskell-compiler/bindistprep/ghc-8.5.20180519/lib\hpc-0.6.0.3
7014Installing library in C:/msys64/var/drydock/workingcopy-121273/repo/glasgow-haskell-compiler/bindistprep/ghc-8.5.20180519/lib\pretty-1.1.3.6
7015Installing library in C:/msys64/var/drydock/workingcopy-121273/repo/glasgow-haskell-compiler/bindistprep/ghc-8.5.20180519/lib\binary-0.8.5.1
7016Installing library in C:/msys64/var/drydock/workingcopy-121273/repo/glasgow-haskell-compiler/bindistprep/ghc-8.5.20180519/lib\text-1.2.3.0
7017Installing library in C:/msys64/var/drydock/workingcopy-121273/repo/glasgow-haskell-compiler/bindistprep/ghc-8.5.20180519/lib\transformers-0.5.5.0
7018Installing library in C:/msys64/var/drydock/workingcopy-121273/repo/glasgow-haskell-compiler/bindistprep/ghc-8.5.20180519/lib\mtl-2.2.2
7019Installing library in C:/msys64/var/drydock/workingcopy-121273/repo/glasgow-haskell-compiler/bindistprep/ghc-8.5.20180519/lib\parsec-3.1.13.0.0.0.0.0
7020Installing library in C:/msys64/var/drydock/workingcopy-121273/repo/glasgow-haskell-compiler/bindistprep/ghc-8.5.20180519/lib\Cabal-2.3.0.0
7021Installing library in C:/msys64/var/drydock/workingcopy-121273/repo/glasgow-haskell-compiler/bindistprep/ghc-8.5.20180519/lib\ghc-boot-th-8.5
7022Installing library in C:/msys64/var/drydock/workingcopy-121273/repo/glasgow-haskell-compiler/bindistprep/ghc-8.5.20180519/lib\ghc-boot-8.5
7023Installing library in C:/msys64/var/drydock/workingcopy-121273/repo/glasgow-haskell-compiler/bindistprep/ghc-8.5.20180519/lib\template-haskell-2.14.0.0
7024Installing library in C:/msys64/var/drydock/workingcopy-121273/repo/glasgow-haskell-compiler/bindistprep/ghc-8.5.20180519/lib\ghc-compact-0.1.0.0
7025Installing library in C:/msys64/var/drydock/workingcopy-121273/repo/glasgow-haskell-compiler/bindistprep/ghc-8.5.20180519/lib\xhtml-3000.2.2
7026Installing library in C:/msys64/var/drydock/workingcopy-121273/repo/glasgow-haskell-compiler/bindistprep/ghc-8.5.20180519/lib\stm-2.4.5.0
7027Installing library in C:/msys64/var/drydock/workingcopy-121273/repo/glasgow-haskell-compiler/bindistprep/ghc-8.5.20180519/lib\haskeline-0.7.4.2
7028Installing library in C:/msys64/var/drydock/workingcopy-121273/repo/glasgow-haskell-compiler/bindistprep/ghc-8.5.20180519/lib\ghci-8.5
7029Installing library in C:/msys64/var/drydock/workingcopy-121273/repo/glasgow-haskell-compiler/bindistprep/ghc-8.5.20180519/lib\ghc-8.5
7030Installing library in C:/msys64/var/drydock/workingcopy-121273/repo/glasgow-haskell-compiler/bindistprep/ghc-8.5.20180519/lib\parallel-3.2.1.1
7031Installing library in C:/msys64/var/drydock/workingcopy-121273/repo/glasgow-haskell-compiler/bindistprep/ghc-8.5.20180519/lib\random-1.1
7032Reading package info from "rts/dist/package.conf.install" ... done.
7033Registering library for ghc-prim-0.5.2.1..
7034Registering library for integer-gmp-1.0.2.0..
7035

Drydock: Prepare tree

When
Completed at Jun 1 2018, 11:26 PM · Built for 1 m, 14 s
Status
Passed

Build Log 272343 (remote - stderr)
25 - 50 - 100 - Unlimited Lines

1+ git clean -qxfd
2+ git submodule foreach git checkout .
3+ git submodule foreach git clean -qxfd
4+ git submodule sync
5+ git submodule update --init --recursive
6+ git submodule foreach -q git clean -qxfd
7

Build Log 272342 (remote - stdout)
25 - 50 - 100 - Unlimited Lines

81Synchronizing submodule url for 'libraries/haskeline'
82Synchronizing submodule url for 'libraries/hpc'
83Synchronizing submodule url for 'libraries/integer-gmp/gmp/gmp-tarballs'
84Synchronizing submodule url for 'libraries/mtl'
85Synchronizing submodule url for 'libraries/parallel'
86Synchronizing submodule url for 'libraries/parsec'
87Synchronizing submodule url for 'libraries/pretty'
88Synchronizing submodule url for 'libraries/primitive'
89Synchronizing submodule url for 'libraries/process'
90Synchronizing submodule url for 'libraries/random'
91Synchronizing submodule url for 'libraries/stm'
92Synchronizing submodule url for 'libraries/terminfo'
93Synchronizing submodule url for 'libraries/text'
94Synchronizing submodule url for 'libraries/time'
95Synchronizing submodule url for 'libraries/transformers'
96Synchronizing submodule url for 'libraries/unix'
97Synchronizing submodule url for 'libraries/vector'
98Synchronizing submodule url for 'libraries/xhtml'
99Synchronizing submodule url for 'nofib'
100Synchronizing submodule url for 'utils/haddock'
101Synchronizing submodule url for 'utils/hsc2hs'
102Submodule path 'libraries/Cabal': checked out 'cbdb135bdadab9595f1a80be4c65453b49a9dde2'
103Submodule path 'libraries/array': checked out '82a29b198a67f54de2f72d96ca077800afbfbe4f'
104Submodule path 'utils/haddock': checked out '46ff2306f580c44915a6f3adb652f02b7f4edfe9'
105

Lease Working Copy

When
Completed at Jun 1 2018, 11:25 PM · Built for 1 w, 5 d
Status
Passed