Build 45986

Properties

Drydock: Build

When
Completed at May 23 2018, 6:56 AM · Built for 48 m, 51 s
Status
Failed

Build Log 270001 (remote - stderr)
25 - 50 - 100 - Unlimited Lines

608 Text.PrettyPrint.Annotated.HughesPJ, Text.PrettyPrint.HughesPJ,
609 Data.Text, Data.Text.Lazy]
610 []
611Warning: -rtsopts and -with-rtsopts have no effect with -no-hs-main.
612 Call hs_init_ghc() from your main() function to set these options.
613Warning: -rtsopts and -with-rtsopts have no effect with -shared.
614 Call hs_init_ghc() from your main() function to set these options.
615Warning: -rtsopts and -with-rtsopts have no effect with -no-hs-main.
616 Call hs_init_ghc() from your main() function to set these options.
617ar: creating compiler/stage2/build/libHSghc-8.5.a
618Warning: -rtsopts and -with-rtsopts have no effect with -shared.
619 Call hs_init_ghc() from your main() function to set these options.
620Warning: -rtsopts and -with-rtsopts have no effect with -no-hs-main.
621 Call hs_init_ghc() from your main() function to set these options.
622/bin/bash: line 1: 26058 Bus error "inplace/bin/ghc-stage2" -hisuf hi -osuf o -hcsuf hc -static -O0 -H64m -Wall -Werror -this-unit-id parallel-3.2.1.1 -hide-all-packages -i -ilibraries/parallel/. -ilibraries/parallel/dist-install/build -Ilibraries/parallel/dist-install/build -ilibraries/parallel/dist-install/build/./autogen -Ilibraries/parallel/dist-install/build/./autogen -Ilibraries/parallel/. -optP-include -optPlibraries/parallel/dist-install/build/./autogen/cabal_macros.h -package-id array-0.5.2.0 -package-id base-4.12.0.0 -package-id containers-0.5.11.0 -package-id deepseq-1.4.4.0 -Wall -feager-blackholing -XHaskell2010 -O -dcore-lint -dno-debug-output -no-user-package-db -rtsopts -Wno-deprecated-flags -Wnoncanonical-monad-instances -odir libraries/parallel/dist-install/build -hidir libraries/parallel/dist-install/build -stubdir libraries/parallel/dist-install/build -dynamic-too -c libraries/parallel/./Control/Parallel.hs -o libraries/parallel/dist-install/build/Control/Parallel.o -dyno libraries/parallel/dist-install/build/Control/Parallel.dyn_o
623make[1]: *** [libraries/parallel/dist-install/build/Control/Parallel.o] Error 135
624make[1]: *** Waiting for unfinished jobs....
625/bin/bash: line 1: 26056 Bus error "inplace/bin/ghc-stage2" -hisuf hi -osuf o -hcsuf hc -static -O0 -H64m -Wall -Werror -this-unit-id parallel-3.2.1.1 -hide-all-packages -i -ilibraries/parallel/. -ilibraries/parallel/dist-install/build -Ilibraries/parallel/dist-install/build -ilibraries/parallel/dist-install/build/./autogen -Ilibraries/parallel/dist-install/build/./autogen -Ilibraries/parallel/. -optP-include -optPlibraries/parallel/dist-install/build/./autogen/cabal_macros.h -package-id array-0.5.2.0 -package-id base-4.12.0.0 -package-id containers-0.5.11.0 -package-id deepseq-1.4.4.0 -Wall -feager-blackholing -XHaskell2010 -O -dcore-lint -dno-debug-output -no-user-package-db -rtsopts -Wno-deprecated-flags -Wnoncanonical-monad-instances -odir libraries/parallel/dist-install/build -hidir libraries/parallel/dist-install/build -stubdir libraries/parallel/dist-install/build -dynamic-too -c libraries/parallel/./Control/Seq.hs -o libraries/parallel/dist-install/build/Control/Seq.o -dyno libraries/parallel/dist-install/build/Control/Seq.dyn_o
626make[1]: *** [libraries/parallel/dist-install/build/Control/Seq.o] Error 135
627/bin/bash: line 1: 26061 Bus error "inplace/bin/ghc-stage2" -hisuf dyn_hi -osuf dyn_o -hcsuf dyn_hc -fPIC -dynamic -O0 -H64m -Wall -Werror -hide-all-packages -i -iutils/haddock/driver -iutils/haddock/haddock-api/src -iutils/haddock/haddock-library/vendor/attoparsec-0.13.1.0 -iutils/haddock/haddock-library/src -iutils/haddock/dist/build -Iutils/haddock/dist/build -iutils/haddock/dist/build/haddock/autogen -Iutils/haddock/dist/build/haddock/autogen -optP-DIN_GHC_TREE -optP-include -optPutils/haddock/dist/build/haddock/autogen/cabal_macros.h -package-id Cabal-2.3.0.0 -package-id array-0.5.2.0 -package-id base-4.12.0.0 -package-id bytestring-0.10.8.2 -package-id containers-0.5.11.0 -package-id deepseq-1.4.4.0 -package-id directory-1.3.2.3 -package-id filepath-1.4.2 -package-id ghc-8.5 -package-id ghc-boot-8.5 -package-id transformers-0.5.5.0 -package-id xhtml-3000.2.2 -funbox-strict-fields -Wall -fwarn-tabs -O2 -threaded -XHaskell2010 -no-user-package-db -rtsopts -Wno-unused-imports -Wno-deprecations -Wnoncanonical-monad-instances -odir utils/haddock/dist/build -hidir utils/haddock/dist/build -stubdir utils/haddock/dist/build -c utils/haddock/haddock-library/src/Documentation/Haddock/Types.hs -o utils/haddock/dist/build/Documentation/Haddock/Types.dyn_o
628make[1]: *** [utils/haddock/dist/build/Documentation/Haddock/Types.dyn_o] Error 135
629/bin/bash: line 1: 26060 Bus error "inplace/bin/ghc-stage2" -hisuf dyn_hi -osuf dyn_o -hcsuf dyn_hc -fPIC -dynamic -O0 -H64m -Wall -Werror -hide-all-packages -i -iutils/haddock/driver -iutils/haddock/haddock-api/src -iutils/haddock/haddock-library/vendor/attoparsec-0.13.1.0 -iutils/haddock/haddock-library/src -iutils/haddock/dist/build -Iutils/haddock/dist/build -iutils/haddock/dist/build/haddock/autogen -Iutils/haddock/dist/build/haddock/autogen -optP-DIN_GHC_TREE -optP-include -optPutils/haddock/dist/build/haddock/autogen/cabal_macros.h -package-id Cabal-2.3.0.0 -package-id array-0.5.2.0 -package-id base-4.12.0.0 -package-id bytestring-0.10.8.2 -package-id containers-0.5.11.0 -package-id deepseq-1.4.4.0 -package-id directory-1.3.2.3 -package-id filepath-1.4.2 -package-id ghc-8.5 -package-id ghc-boot-8.5 -package-id transformers-0.5.5.0 -package-id xhtml-3000.2.2 -funbox-strict-fields -Wall -fwarn-tabs -O2 -threaded -XHaskell2010 -no-user-package-db -rtsopts -Wno-unused-imports -Wno-deprecations -Wnoncanonical-monad-instances -odir utils/haddock/dist/build -hidir utils/haddock/dist/build -stubdir utils/haddock/dist/build -c utils/haddock/haddock-api/src/Haddock/Backends/Hyperlinker/Types.hs -o utils/haddock/dist/build/Haddock/Backends/Hyperlinker/Types.dyn_o
630make[1]: *** [utils/haddock/dist/build/Haddock/Backends/Hyperlinker/Types.dyn_o] Error 135
631make: *** [all] Error 2
632

Build Log 270000 (remote - stdout)
25 - 50 - 100 - Unlimited Lines

5347 HC [stage 1] compiler/stage2/build/InteractiveEval.o
5348 HC [stage 1] compiler/stage2/build/TcSplice.o
5349 HC [stage 1] compiler/stage2/build/GhcMake.o
5350 HC [stage 1] compiler/stage2/build/GHC.o
5351 HC [stage 1] compiler/stage2/build/Debugger.o
5352 HC [stage 1] compiler/stage2/build/DriverBkp.o
5353 HC [stage 1] compiler/stage2/build/DriverMkDepend.o
5354 HC [stage 1] ghc/stage2/build/GHCi/UI/Info.dyn_o
5355 HC [stage 1] ghc/stage2/build/GHCi/UI/Monad.dyn_o
5356 HC [stage 1] compiler/stage2/build/libHSghc-8.5-ghc8.5.20180520.so
5357 AR compiler/stage2/build/libHSghc-8.5.a
5358 HC [stage 1] ghc/stage2/build/GHCi/UI/Tags.dyn_o
5359 HC [stage 1] ghc/stage2/build/GHCi/UI.dyn_o
5360 HC [stage 1] ghc/stage2/build/Main.dyn_o
5361 HC [stage 1] ghc/stage2/build/tmp/ghc-stage2
5362 HC [stage 2] libraries/parallel/dist-install/build/Control/Seq.o
5363 HC [stage 2] libraries/parallel/dist-install/build/Control/Parallel.o
5364 HC [stage 2] utils/haddock/dist/build/Haddock/Backends/Hyperlinker/Types.dyn_o
5365 HC [stage 2] utils/haddock/dist/build/Documentation/Haddock/Types.dyn_o
5366libraries/parallel/ghc.mk:5: recipe for target 'libraries/parallel/dist-install/build/Control/Parallel.o' failed
5367libraries/parallel/ghc.mk:5: recipe for target 'libraries/parallel/dist-install/build/Control/Seq.o' failed
5368utils/haddock/ghc.mk:20: recipe for target 'utils/haddock/dist/build/Documentation/Haddock/Types.dyn_o' failed
5369utils/haddock/ghc.mk:20: recipe for target 'utils/haddock/dist/build/Haddock/Backends/Hyperlinker/Types.dyn_o' failed
5370Makefile:122: recipe for target 'all' failed
5371

Drydock: Prepare tree

When
Completed at May 23 2018, 6:07 AM · Built for 4 s
Status
Passed

Build Log 269999 (remote - stderr)
25 - 50 - 100 - Unlimited Lines

1+ git clean -qxfd
2+ git submodule sync
3+ git submodule update --init --recursive
4+ git submodule foreach -q git clean -qxfd
5

Build Log 269998 (remote - stdout)
25 - 50 - 100 - Unlimited Lines

10Synchronizing submodule url for 'libraries/directory'
11Synchronizing submodule url for 'libraries/dph'
12Synchronizing submodule url for 'libraries/filepath'
13Synchronizing submodule url for 'libraries/haskeline'
14Synchronizing submodule url for 'libraries/hpc'
15Synchronizing submodule url for 'libraries/integer-gmp/gmp/gmp-tarballs'
16Synchronizing submodule url for 'libraries/mtl'
17Synchronizing submodule url for 'libraries/parallel'
18Synchronizing submodule url for 'libraries/parsec'
19Synchronizing submodule url for 'libraries/pretty'
20Synchronizing submodule url for 'libraries/primitive'
21Synchronizing submodule url for 'libraries/process'
22Synchronizing submodule url for 'libraries/random'
23Synchronizing submodule url for 'libraries/stm'
24Synchronizing submodule url for 'libraries/terminfo'
25Synchronizing submodule url for 'libraries/text'
26Synchronizing submodule url for 'libraries/time'
27Synchronizing submodule url for 'libraries/transformers'
28Synchronizing submodule url for 'libraries/unix'
29Synchronizing submodule url for 'libraries/vector'
30Synchronizing submodule url for 'libraries/xhtml'
31Synchronizing submodule url for 'nofib'
32Synchronizing submodule url for 'utils/haddock'
33Synchronizing submodule url for 'utils/hsc2hs'
34

Build Working Copy

When
Completed at May 23 2018, 6:07 AM · Built for 2 d, 12 h
Status
Passed
Description

Lease a working copy for Linux/amd64 builds.