Build 45984

Properties

Drydock: Build

When
Completed at Jun 1 2018, 1:57 PM · Built for 4 h
Status
Failed

Build Log 272195 (remote - stderr)
25 - 50 - 100 - Unlimited Lines

632 Distribution.Utils.ShortText, Distribution.Verbosity,
633 Language.Haskell.Extension, Control.Applicative, Data.Complex,
634 Data.Functor.Compose, Data.Functor.Const, Data.Functor.Identity,
635 Data.Functor.Product, Data.Functor.Sum, Data.Monoid,
636 Data.Semigroup, Data.Semigroup.Internal, Data.Version, Data.Void,
637 GHC.Exts, GHC.Generics, GHC.IO.Exception, Data.Graph,
638 Data.IntMap.Internal, Data.IntSet.Internal, Data.Map.Internal,
639 Data.Sequence.Internal, Data.Set.Internal, Data.Tree,
640 Text.PrettyPrint.Annotated.HughesPJ, Text.PrettyPrint.HughesPJ,
641 Data.Text, Data.Text.Lazy]
642 []
643Warning: -rtsopts and -with-rtsopts have no effect with -no-hs-main.
644 Call hs_init_ghc() from your main() function to set these options.
645C:\msys64\var\drydock\workingcopy-121273\repo\glasgow-haskell-compiler\inplace\mingw\bin\ar.exe: creating compiler/stage2/build/libHSghc-8.5.a
646Warning: -rtsopts and -with-rtsopts have no effect with -no-hs-main.
647 Call hs_init_ghc() from your main() function to set these options.
648/bin/sh: line 1: 4944 Terminated "inplace/bin/ghc-stage2.exe" -hisuf hi -osuf o -hcsuf hc -static -O0 -H64m -Wall -Werror -hide-all-packages -i -iutils/haddock/driver -iutils/haddock/haddock-api/src -iutils/haddock/haddock-library/vendor/attoparsec-0.13.1.0 -iutils/haddock/haddock-library/src -iutils/haddock/dist/build -Iutils/haddock/dist/build -iutils/haddock/dist/build/haddock/autogen -Iutils/haddock/dist/build/haddock/autogen -optP-DIN_GHC_TREE -optP-include -optPutils/haddock/dist/build/haddock/autogen/cabal_macros.h -package-id Cabal-2.3.0.0 -package-id array-0.5.2.0 -package-id base-4.12.0.0 -package-id bytestring-0.10.8.2 -package-id containers-0.5.11.0 -package-id deepseq-1.4.4.0 -package-id directory-1.3.2.3 -package-id filepath-1.4.2 -package-id ghc-8.5 -package-id ghc-boot-8.5 -package-id transformers-0.5.5.0 -package-id xhtml-3000.2.2 -funbox-strict-fields -Wall -fwarn-tabs -O2 -threaded -XHaskell2010 -no-user-package-db -rtsopts -Wno-unused-imports -Wno-deprecations -Wnoncanonical-monad-instances -odir utils/haddock/dist/build -hidir utils/haddock/dist/build -stubdir utils/haddock/dist/build -c utils/haddock/haddock-api/src/Haddock/Backends/Hyperlinker/Types.hs -o utils/haddock/dist/build/Haddock/Backends/Hyperlinker/Types.o
649make[1]: *** [libraries/parallel/ghc.mk:5: libraries/parallel/dist-install/build/Control/Parallel.o] Terminated
650make[1]: *** Waiting for unfinished jobs....
651make[1]: *** [utils/haddock/ghc.mk:20: utils/haddock/dist/build/Paths_haddock.o] Terminated
652make[1]: *** [utils/haddock/ghc.mk:20: utils/haddock/dist/build/Documentation/Haddock/Types.o] Terminated
653make[1]: *** [utils/haddock/ghc.mk:20: utils/haddock/dist/build/Haddock/Backends/Hyperlinker/Types.o] Error 143
654make[1]: *** [libraries/parallel/ghc.mk:5: libraries/parallel/dist-install/build/Control/Seq.o] Terminated
655make: *** [Makefile:127: all] Terminated
656

Build Log 272194 (remote - stdout)
25 - 50 - 100 - Unlimited Lines

6469 HC [stage 1] compiler/stage2/build/TcInstDcls.o
6470 HC [stage 1] compiler/stage2/build/TcRnDriver.o
6471 HC [stage 1] compiler/stage2/build/Desugar.o
6472 HC [stage 1] compiler/stage2/build/HscMain.o
6473 HC [stage 1] compiler/stage2/build/DriverPipeline.o
6474 HC [stage 1] compiler/stage2/build/InteractiveEval.o
6475 HC [stage 1] compiler/stage2/build/TcSplice.o
6476 HC [stage 1] compiler/stage2/build/GhcMake.o
6477 HC [stage 1] compiler/stage2/build/GHC.o
6478 HC [stage 1] compiler/stage2/build/Debugger.o
6479 HC [stage 1] ghc/stage2/build/GHCi/UI/Info.o
6480 HC [stage 1] compiler/stage2/build/DriverBkp.o
6481 HC [stage 1] compiler/stage2/build/DriverMkDepend.o
6482 HC [stage 1] ghc/stage2/build/GHCi/UI/Monad.o
6483 AR compiler/stage2/build/libHSghc-8.5.a
6484 HC [stage 1] ghc/stage2/build/GHCi/UI/Tags.o
6485 HC [stage 1] ghc/stage2/build/GHCi/UI.o
6486 HC [stage 1] ghc/stage2/build/Main.o
6487 HC [stage 1] ghc/stage2/build/tmp/ghc-stage2.exe
6488 HC [stage 2] libraries/parallel/dist-install/build/Control/Seq.o
6489 HC [stage 2] libraries/parallel/dist-install/build/Control/Parallel.o
6490 HC [stage 2] utils/haddock/dist/build/Haddock/Backends/Hyperlinker/Types.o
6491 HC [stage 2] utils/haddock/dist/build/Documentation/Haddock/Types.o
6492 HC [stage 2] utils/haddock/dist/build/Paths_haddock.o
6493

Drydock: Prepare tree

When
Completed at Jun 1 2018, 9:57 AM · Built for 44 s
Status
Passed

Build Log 272193 (remote - stderr)
25 - 50 - 100 - Unlimited Lines

1+ git clean -qxfd
2+ git submodule foreach git checkout .
3+ git submodule foreach git clean -qxfd
4+ git submodule sync
5+ git submodule update --init --recursive
6+ git submodule foreach -q git clean -qxfd
7

Build Log 272192 (remote - stdout)
25 - 50 - 100 - Unlimited Lines

78Synchronizing submodule url for 'libraries/directory'
79Synchronizing submodule url for 'libraries/dph'
80Synchronizing submodule url for 'libraries/filepath'
81Synchronizing submodule url for 'libraries/haskeline'
82Synchronizing submodule url for 'libraries/hpc'
83Synchronizing submodule url for 'libraries/integer-gmp/gmp/gmp-tarballs'
84Synchronizing submodule url for 'libraries/mtl'
85Synchronizing submodule url for 'libraries/parallel'
86Synchronizing submodule url for 'libraries/parsec'
87Synchronizing submodule url for 'libraries/pretty'
88Synchronizing submodule url for 'libraries/primitive'
89Synchronizing submodule url for 'libraries/process'
90Synchronizing submodule url for 'libraries/random'
91Synchronizing submodule url for 'libraries/stm'
92Synchronizing submodule url for 'libraries/terminfo'
93Synchronizing submodule url for 'libraries/text'
94Synchronizing submodule url for 'libraries/time'
95Synchronizing submodule url for 'libraries/transformers'
96Synchronizing submodule url for 'libraries/unix'
97Synchronizing submodule url for 'libraries/vector'
98Synchronizing submodule url for 'libraries/xhtml'
99Synchronizing submodule url for 'nofib'
100Synchronizing submodule url for 'utils/haddock'
101Synchronizing submodule url for 'utils/hsc2hs'
102

Lease Working Copy

When
Completed at Jun 1 2018, 9:57 AM · Built for 1 w, 4 d
Status
Passed