Build 45950

Drydock: Build

When
Completed at May 21 2018, 6:30 PM · Built for 4 d, 7 h
Status
Failed

Build Log 269444 (remote - stderr)
25 - 50 - 100 - Unlimited Lines

590C:\msys64\var\drydock\workingcopy-121273\repo\glasgow-haskell-compiler\inplace\mingw\bin\ar.exe: creating libraries/random/dist-install/build/libHSrandom-1.1.a
591Warning: include-dirs: C:\msys64\var\drydock\workingcopy-121273\repo\glasgow-haskell-compiler\compiler\stage2\build\utils doesn't exist or isn't a directory
592Warning: include-dirs: C:\msys64\var\drydock\workingcopy-121273\repo\glasgow-haskell-compiler\compiler\stage2\build\../rts/dist/build doesn't exist or isn't a directory
593Warning: include-dirs: C:\msys64\var\drydock\workingcopy-121273\repo\glasgow-haskell-compiler\compiler\stage2\build\stage2 doesn't exist or isn't a directory
594Warning: include-dirs: C:\msys64\var\drydock\workingcopy-121273\repo\glasgow-haskell-compiler\libraries\haskeline\dist-install\build\includes doesn't exist or isn't a directory
595Warning: include-dirs: C:\msys64\var\drydock\workingcopy-121273\repo\glasgow-haskell-compiler\libraries\text\dist-install\build\include doesn't exist or isn't a directory
596Warning: include-dirs: C:\msys64\var\drydock\workingcopy-121273\repo\glasgow-haskell-compiler\libraries\Win32\dist-install\build\include doesn't exist or isn't a directory
597Warning: include-dirs: C:\msys64\var\drydock\workingcopy-121273\repo\glasgow-haskell-compiler\libraries\containers\dist-install\build\include doesn't exist or isn't a directory
598Warning: include-dirs: C:\msys64\var\drydock\workingcopy-121273\repo\glasgow-haskell-compiler\libraries\bytestring\dist-install\build\include doesn't exist or isn't a directory
599rts-1.0: Warning: .:479:1: The field "hugs-options" is deprecated. hugs isn't supported anymore
600ghc-cabal.exe:
601'C:/msys64/var/drydock/workingcopy-121273/repo/glasgow-haskell-compiler/bindistprep/ghc-8.5.20180517/bin/ghc.exe'
602exited with an error:
603ghc.exe: internal error: evacuate: strange closure type 61524025
604(GHC version 8.5.20180517 for x86_64_unknown_mingw32)
605Please report this as a GHC bug: http://www.haskell.org/ghc/reportabug
606
607This application has requested the Runtime to terminate it in an unusual way.
608Please contact the application's support team for more information.
609
610make[3]: *** [ghc.mk:1003: install_packages] Error 1
611make[2]: *** [Makefile:127: install] Error 2
612make[1]: *** [ghc.mk:1126: windows-binary-dist-prep] Error 2
613make: *** [Makefile:145: binary-dist-prep] Error 2
614

Build Log 269443 (remote - stdout)
25 - 50 - 100 - Unlimited Lines

7011Installing library in C:/msys64/var/drydock/workingcopy-121273/repo/glasgow-haskell-compiler/bindistprep/ghc-8.5.20180517/lib\directory-1.3.2.3
7012Installing library in C:/msys64/var/drydock/workingcopy-121273/repo/glasgow-haskell-compiler/bindistprep/ghc-8.5.20180517/lib\process-1.6.3.0
7013Installing library in C:/msys64/var/drydock/workingcopy-121273/repo/glasgow-haskell-compiler/bindistprep/ghc-8.5.20180517/lib\hpc-0.6.0.3
7014Installing library in C:/msys64/var/drydock/workingcopy-121273/repo/glasgow-haskell-compiler/bindistprep/ghc-8.5.20180517/lib\pretty-1.1.3.6
7015Installing library in C:/msys64/var/drydock/workingcopy-121273/repo/glasgow-haskell-compiler/bindistprep/ghc-8.5.20180517/lib\binary-0.8.5.1
7016Installing library in C:/msys64/var/drydock/workingcopy-121273/repo/glasgow-haskell-compiler/bindistprep/ghc-8.5.20180517/lib\text-1.2.3.0
7017Installing library in C:/msys64/var/drydock/workingcopy-121273/repo/glasgow-haskell-compiler/bindistprep/ghc-8.5.20180517/lib\transformers-0.5.5.0
7018Installing library in C:/msys64/var/drydock/workingcopy-121273/repo/glasgow-haskell-compiler/bindistprep/ghc-8.5.20180517/lib\mtl-2.2.2
7019Installing library in C:/msys64/var/drydock/workingcopy-121273/repo/glasgow-haskell-compiler/bindistprep/ghc-8.5.20180517/lib\parsec-3.1.13.0.0.0.0.0
7020Installing library in C:/msys64/var/drydock/workingcopy-121273/repo/glasgow-haskell-compiler/bindistprep/ghc-8.5.20180517/lib\Cabal-2.3.0.0
7021Installing library in C:/msys64/var/drydock/workingcopy-121273/repo/glasgow-haskell-compiler/bindistprep/ghc-8.5.20180517/lib\ghc-boot-th-8.5
7022Installing library in C:/msys64/var/drydock/workingcopy-121273/repo/glasgow-haskell-compiler/bindistprep/ghc-8.5.20180517/lib\ghc-boot-8.5
7023Installing library in C:/msys64/var/drydock/workingcopy-121273/repo/glasgow-haskell-compiler/bindistprep/ghc-8.5.20180517/lib\template-haskell-2.14.0.0
7024Installing library in C:/msys64/var/drydock/workingcopy-121273/repo/glasgow-haskell-compiler/bindistprep/ghc-8.5.20180517/lib\ghc-compact-0.1.0.0
7025Installing library in C:/msys64/var/drydock/workingcopy-121273/repo/glasgow-haskell-compiler/bindistprep/ghc-8.5.20180517/lib\xhtml-3000.2.2
7026Installing library in C:/msys64/var/drydock/workingcopy-121273/repo/glasgow-haskell-compiler/bindistprep/ghc-8.5.20180517/lib\stm-2.4.5.0
7027Installing library in C:/msys64/var/drydock/workingcopy-121273/repo/glasgow-haskell-compiler/bindistprep/ghc-8.5.20180517/lib\haskeline-0.7.4.2
7028Installing library in C:/msys64/var/drydock/workingcopy-121273/repo/glasgow-haskell-compiler/bindistprep/ghc-8.5.20180517/lib\ghci-8.5
7029Installing library in C:/msys64/var/drydock/workingcopy-121273/repo/glasgow-haskell-compiler/bindistprep/ghc-8.5.20180517/lib\ghc-8.5
7030Installing library in C:/msys64/var/drydock/workingcopy-121273/repo/glasgow-haskell-compiler/bindistprep/ghc-8.5.20180517/lib\parallel-3.2.1.1
7031Installing library in C:/msys64/var/drydock/workingcopy-121273/repo/glasgow-haskell-compiler/bindistprep/ghc-8.5.20180517/lib\random-1.1
7032Reading package info from "rts/dist/package.conf.install" ... done.
7033Registering library for ghc-prim-0.5.2.1..
7034Registering library for integer-gmp-1.0.2.0..
7035

Build Log 269436 (remote - stderr)
25 - 50 - 100 - Unlimited Lines

84 Module ‘Prelude’ does not export ‘(<>)’
85 |
8644 | import Prelude hiding ((<>))
87 | ^^^^^^^^^^^^^^^^^^^^^^^^^^^^
88
89libraries\template-haskell\Language\Haskell\TH\Ppr.hs:17:1: warning: [-Wdodgy-imports]
90 Module ‘Prelude’ does not export ‘(<>)’
91 |
9217 | import Prelude hiding ((<>))
93 | ^^^^^^^^^^^^^^^^^^^^^^^^^^^^
94C:\msys64\home\drydock\ghc-8.2.1-amd64\mingw\bin\ar.exe: creating libraries/mtl/dist-boot/build/libHSmtl-2.2.2.a
95C:\msys64\home\drydock\ghc-8.2.1-amd64\mingw\bin\ar.exe: creating libraries/template-haskell/dist-boot/build/libHStemplate-haskell-2.14.0.0.a
96C:\msys64\home\drydock\ghc-8.2.1-amd64\mingw\bin\ar.exe: creating libraries/binary/dist-boot/build/libHSbinary-0.8.5.1.a
97C:\msys64\home\drydock\ghc-8.2.1-amd64\mingw\bin\ar.exe: creating libraries/ghc-boot/dist-boot/build/libHSghc-boot-8.5.a
98C:\msys64\home\drydock\ghc-8.2.1-amd64\mingw\bin\ar.exe: creating libraries/ghci/dist-boot/build/libHSghci-8.5.a
99
100compiler\main\DynFlags.hs:246:1: warning: [-Wunused-imports]
101 The import of ‘Foreign’ is redundant
102 except perhaps to import instances from ‘Foreign’
103 To import instances alone, use: import Foreign()
104 |
105246 | import Foreign (Ptr) -- needed for 2nd stage
106 | ^^^^^^^^^^^^^^^^^^^^
107C:\msys64\home\drydock\ghc-8.2.1-amd64\mingw\bin\ar.exe: creating libraries/parsec/dist-boot/build/libHSparsec-3.1.13.0.0.0.0.0.a
108

Build Log 269435 (remote - stdout)
25 - 50 - 100 - Unlimited Lines

1084 HC [stage 0] libraries/text/dist-boot/build/Data/Text/Lazy/Builder.o
1085 HC [stage 0] libraries/parsec/dist-boot/build/Text/Parsec.o
1086 HC [stage 0] libraries/Cabal/Cabal/dist-boot/build/Distribution/Parsec/Parser.o
1087 HC [stage 0] libraries/parsec/dist-boot/build/Text/Parsec/Token.o
1088 HC [stage 0] libraries/parsec/dist-boot/build/Text/Parsec/Expr.o
1089 HC [stage 0] libraries/parsec/dist-boot/build/Text/ParserCombinators/Parsec/Char.o
1090 HC [stage 0] libraries/parsec/dist-boot/build/Text/ParserCombinators/Parsec/Combinator.o
1091 HC [stage 0] libraries/text/dist-boot/build/Data/Text/Internal/Builder/Functions.o
1092 HC [stage 0] libraries/Cabal/Cabal/dist-boot/build/Distribution/Compat/Parsing.o
1093 HC [stage 0] libraries/Cabal/Cabal/dist-boot/build/Distribution/Parsec/FieldLineStream.o
1094 HC [stage 0] libraries/parsec/dist-boot/build/Text/Parsec/Language.o
1095 HC [stage 0] libraries/parsec/dist-boot/build/Text/Parsec/Perm.o
1096 HC [stage 0] libraries/parsec/dist-boot/build/Text/ParserCombinators/Parsec.o
1097 HC [stage 0] libraries/parsec/dist-boot/build/Text/ParserCombinators/Parsec/Language.o
1098 HC [stage 0] libraries/parsec/dist-boot/build/Text/ParserCombinators/Parsec/Token.o
1099 HC [stage 0] libraries/text/dist-boot/build/Data/Text/Lazy/Builder/Int.o
1100 HC [stage 0] libraries/Cabal/Cabal/dist-boot/build/Distribution/Compat/CharParsing.o
1101 HC [stage 0] libraries/parsec/dist-boot/build/Text/ParserCombinators/Parsec/Expr.o
1102 HC [stage 0] libraries/parsec/dist-boot/build/Text/ParserCombinators/Parsec/Perm.o
1103 HC [stage 0] libraries/Cabal/Cabal/dist-boot/build/Distribution/Parsec/Class.o
1104 AR libraries/parsec/dist-boot/build/libHSparsec-3.1.13.0.0.0.0.0.a
1105 HC [stage 0] libraries/Cabal/Cabal/dist-boot/build/Distribution/Text.o
1106 HC [stage 0] libraries/Cabal/Cabal/dist-boot/build/Distribution/SPDX/LicenseReference.o
1107 HC [stage 0] libraries/Cabal/Cabal/dist-boot/build/Distribution/SPDX/LicenseId.o
1108

Build Log 269426 (remote - stderr)
25 - 50 - 100 - Unlimited Lines

181 |
18217 | import Prelude hiding ((<>))
183 | ^^^^^^^^^^^^^^^^^^^^^^^^^^^^
184C:\msys64\home\drydock\ghc-8.2.1-amd64\mingw\bin\ar.exe: creating libraries/mtl/dist-boot/build/libHSmtl-2.2.2.a
185C:\msys64\home\drydock\ghc-8.2.1-amd64\mingw\bin\ar.exe: creating libraries/template-haskell/dist-boot/build/libHStemplate-haskell-2.14.0.0.a
186C:\msys64\home\drydock\ghc-8.2.1-amd64\mingw\bin\ar.exe: creating libraries/binary/dist-boot/build/libHSbinary-0.8.5.1.a
187C:\msys64\home\drydock\ghc-8.2.1-amd64\mingw\bin\ar.exe: creating libraries/ghc-boot/dist-boot/build/libHSghc-boot-8.5.a
188C:\msys64\home\drydock\ghc-8.2.1-amd64\mingw\bin\ar.exe: creating libraries/ghci/dist-boot/build/libHSghci-8.5.a
189
190compiler\main\DynFlags.hs:246:1: warning: [-Wunused-imports]
191 The import of ‘Foreign’ is redundant
192 except perhaps to import instances from ‘Foreign’
193 To import instances alone, use: import Foreign()
194 |
195246 | import Foreign (Ptr) -- needed for 2nd stage
196 | ^^^^^^^^^^^^^^^^^^^^
197C:\msys64\home\drydock\ghc-8.2.1-amd64\mingw\bin\ar.exe: creating libraries/parsec/dist-boot/build/libHSparsec-3.1.13.0.0.0.0.0.a
198C:\msys64\home\drydock\ghc-8.2.1-amd64\mingw\bin\ar.exe: creating libraries/text/dist-boot/build/libHStext-1.2.3.0.a
199C:\msys64\home\drydock\ghc-8.2.1-amd64\mingw\bin\ar.exe: creating libraries/Cabal/Cabal/dist-boot/build/libHSCabal-2.3.0.0.a
200rts-1.0: Warning: .:480:1: The field "hugs-options" is deprecated. hugs isn't supported anymore
201rts-1.0: Warning: library-dirs: C:/msys64/var/drydock/workingcopy-121273/repo/glasgow-haskell-compiler/rts/dist/build doesn't exist or isn't a directory
202rts-1.0: Warning: include-dirs: C:/msys64/var/drydock/workingcopy-121273/repo/glasgow-haskell-compiler/rts/dist/build doesn't exist or isn't a directory
203rts-1.0: cannot find any of ["libHSrts.a","libHSrts.p_a","libHSrts-ghc8.5.20180517.so","libHSrts-ghc8.5.20180517.dylib","HSrts-ghc8.5.20180517.dll"] on library path (ignoring)
204rts-1.0: cannot find any of ["libCffi-6.a","libCffi-6.p_a","libCffi-6-ghc8.5.20180517.so","libCffi-6-ghc8.5.20180517.dylib","Cffi-6-ghc8.5.20180517.dll"] on library path (ignoring)
205

Build Log 269425 (remote - stdout)
25 - 50 - 100 - Unlimited Lines

1493 HC [stage 0] compiler/stage1/build/SPARC/CodeGen/CondCode.o
1494 HC [stage 0] compiler/stage1/build/StgCmmTicky.o
1495 HC [stage 0] compiler/stage1/build/StgCmmEnv.o
1496 HC [stage 0] compiler/stage1/build/StgCmmProf.o
1497 HC [stage 0] compiler/stage1/build/LlvmCodeGen/Base.o
1498 HC [stage 0] compiler/stage1/build/RegAlloc/Linear/Main.o
1499 HC [stage 0] compiler/stage1/build/SPARC/CodeGen/Gen64.o
1500 HC [stage 0] compiler/stage1/build/StgCmmLayout.o
1501 HC [stage 0] compiler/stage1/build/SysTools/Tasks.o
1502 HC [stage 0] compiler/stage1/build/LlvmCodeGen/Data.o
1503 HC [stage 0] compiler/stage1/build/LlvmCodeGen/CodeGen.o
1504 HC [stage 0] compiler/stage1/build/SPARC/CodeGen/Gen32.o
1505 HC [stage 0] compiler/stage1/build/StgCmmForeign.o
1506 HC [stage 0] compiler/stage1/build/StgCmmHeap.o
1507 HC [stage 0] compiler/stage1/build/ByteCodeInstr.o
1508 HC [stage 0] compiler/stage1/build/SysTools/ExtraObj.o
1509 HC [stage 0] compiler/stage1/build/LlvmCodeGen/Ppr.o
1510 HC [stage 0] compiler/stage1/build/SPARC/CodeGen.o
1511 HC [stage 0] compiler/stage1/build/CmmLayoutStack.o
1512 HC [stage 0] compiler/stage1/build/CmmBuildInfoTables.o
1513 HC [stage 0] compiler/stage1/build/StgCmmPrim.o
1514 HC [stage 0] compiler/stage1/build/SysTools.o
1515 HC [stage 0] compiler/stage1/build/AsmCodeGen.o
1516 HC [stage 0] compiler/stage1/build/LlvmCodeGen.o
1517

Drydock: Prepare tree

When
Completed at May 17 2018, 11:24 AM · Built for 1 m, 3 s
Status
Passed

Build Log 269424 (remote - stderr)
25 - 50 - 100 - Unlimited Lines

1+ git clean -qxfd
2+ git submodule foreach git checkout .
3+ git submodule foreach git clean -qxfd
4+ git submodule sync
5+ git submodule update --init --recursive
6+ git submodule foreach -q git clean -qxfd
7

Build Log 269423 (remote - stdout)
25 - 50 - 100 - Unlimited Lines

79Synchronizing submodule url for 'libraries/dph'
80Synchronizing submodule url for 'libraries/filepath'
81Synchronizing submodule url for 'libraries/haskeline'
82Synchronizing submodule url for 'libraries/hpc'
83Synchronizing submodule url for 'libraries/integer-gmp/gmp/gmp-tarballs'
84Synchronizing submodule url for 'libraries/mtl'
85Synchronizing submodule url for 'libraries/parallel'
86Synchronizing submodule url for 'libraries/parsec'
87Synchronizing submodule url for 'libraries/pretty'
88Synchronizing submodule url for 'libraries/primitive'
89Synchronizing submodule url for 'libraries/process'
90Synchronizing submodule url for 'libraries/random'
91Synchronizing submodule url for 'libraries/stm'
92Synchronizing submodule url for 'libraries/terminfo'
93Synchronizing submodule url for 'libraries/text'
94Synchronizing submodule url for 'libraries/time'
95Synchronizing submodule url for 'libraries/transformers'
96Synchronizing submodule url for 'libraries/unix'
97Synchronizing submodule url for 'libraries/vector'
98Synchronizing submodule url for 'libraries/xhtml'
99Synchronizing submodule url for 'nofib'
100Synchronizing submodule url for 'utils/haddock'
101Synchronizing submodule url for 'utils/hsc2hs'
102Submodule path 'libraries/Cabal': checked out 'cbdb135bdadab9595f1a80be4c65453b49a9dde2'
103

Lease Working Copy

When
Completed at May 17 2018, 11:23 AM · Built for 54 m, 16 s
Status
Passed