Build 45366

Properties

Drydock: Build

When
Completed at May 7 2018, 7:26 PM · Built for 31 m, 44 s
Status
Failed

Build Log 266627 (remote - stderr)
25 - 50 - 100 - Unlimited Lines

626 Call hs_init_ghc() from your main() function to set these options.
627ar: creating libraries/haskeline/dist-install/build/libHShaskeline-0.7.4.2.a
628Warning: -rtsopts and -with-rtsopts have no effect with -shared.
629 Call hs_init_ghc() from your main() function to set these options.
630ar: creating libraries/parsec/dist-install/build/libHSparsec-3.1.13.0.0.0.0.0.a
631ar: creating libraries/text/dist-install/build/libHStext-1.2.3.0.a
632Warning: -rtsopts and -with-rtsopts have no effect with -shared.
633 Call hs_init_ghc() from your main() function to set these options.
634ar: creating libraries/ghci/dist-install/build/libHSghci-8.5.a
635Warning: -rtsopts and -with-rtsopts have no effect with -shared.
636 Call hs_init_ghc() from your main() function to set these options.
637Warning: -rtsopts and -with-rtsopts have no effect with -shared.
638 Call hs_init_ghc() from your main() function to set these options.
639
640compiler/coreSyn/CoreSeq.hs:73:1: error: [-Wincomplete-patterns, -Werror=incomplete-patterns]
641 Pattern match(es) are non-exhaustive
642 In an equation for ‘seqTickish’:
643 Patterns not matched: (WeightHint _)
644 |
64573 | seqTickish ProfNote{ profNoteCC = cc } = cc `seq` ()
646 | ^^^^^^^^^^^^^^^^^^^^^^^^^^^^^^^^^^^^^^^^^^^^^^^^^^^^...
647make[1]: *** [compiler/stage2/build/CoreSeq.o] Error 1
648make[1]: *** Waiting for unfinished jobs....
649make: *** [all] Error 2
650

Build Log 266626 (remote - stdout)
25 - 50 - 100 - Unlimited Lines

4779 HC [stage 1] compiler/stage2/build/Type.o
4780 HC [stage 1] compiler/stage2/build/Coercion.o
4781 HC [stage 1] compiler/stage2/build/PatSyn.o
4782 HC [stage 1] compiler/stage2/build/Literal.o
4783 HC [stage 1] compiler/stage2/build/HsLit.o
4784 HC [stage 1] compiler/stage2/build/TrieMap.o
4785 HC [stage 1] compiler/stage2/build/Unify.o
4786 HC [stage 1] compiler/stage2/build/DataCon.o
4787 HC [stage 1] compiler/stage2/build/Demand.o
4788 HC [stage 1] compiler/stage2/build/RepType.o
4789 HC [stage 1] compiler/stage2/build/CoreSyn.o
4790 HC [stage 1] compiler/stage2/build/ConLike.o
4791 HC [stage 1] compiler/stage2/build/Vectorise/Type/Classify.o
4792 HC [stage 1] compiler/stage2/build/CoreMap.o
4793 HC [stage 1] compiler/stage2/build/Vectorise/Vect.o
4794 HC [stage 1] compiler/stage2/build/IdInfo.o
4795 HC [stage 1] compiler/stage2/build/Id.o
4796 HC [stage 1] compiler/stage2/build/TysWiredIn.o
4797 HC [stage 1] compiler/stage2/build/CoreStats.o
4798 HC [stage 1] compiler/stage2/build/HsTypes.o
4799 HC [stage 1] compiler/stage2/build/InteractiveEvalTypes.o
4800 HC [stage 1] compiler/stage2/build/CoreSeq.o
4801compiler/ghc.mk:447: recipe for target 'compiler/stage2/build/CoreSeq.o' failed
4802Makefile:122: recipe for target 'all' failed
4803

Drydock: Prepare tree

When
Completed at May 7 2018, 6:54 PM · Built for 2 s
Status
Passed

Build Log 266625 (remote - stderr)
25 - 50 - 100 - Unlimited Lines

1+ git clean -qxfd
2+ git submodule sync
3+ git submodule update --init --recursive
4+ git submodule foreach -q git clean -qxfd
5

Build Log 266624 (remote - stdout)
25 - 50 - 100 - Unlimited Lines

10Synchronizing submodule url for 'libraries/directory'
11Synchronizing submodule url for 'libraries/dph'
12Synchronizing submodule url for 'libraries/filepath'
13Synchronizing submodule url for 'libraries/haskeline'
14Synchronizing submodule url for 'libraries/hpc'
15Synchronizing submodule url for 'libraries/integer-gmp/gmp/gmp-tarballs'
16Synchronizing submodule url for 'libraries/mtl'
17Synchronizing submodule url for 'libraries/parallel'
18Synchronizing submodule url for 'libraries/parsec'
19Synchronizing submodule url for 'libraries/pretty'
20Synchronizing submodule url for 'libraries/primitive'
21Synchronizing submodule url for 'libraries/process'
22Synchronizing submodule url for 'libraries/random'
23Synchronizing submodule url for 'libraries/stm'
24Synchronizing submodule url for 'libraries/terminfo'
25Synchronizing submodule url for 'libraries/text'
26Synchronizing submodule url for 'libraries/time'
27Synchronizing submodule url for 'libraries/transformers'
28Synchronizing submodule url for 'libraries/unix'
29Synchronizing submodule url for 'libraries/vector'
30Synchronizing submodule url for 'libraries/xhtml'
31Synchronizing submodule url for 'nofib'
32Synchronizing submodule url for 'utils/haddock'
33Synchronizing submodule url for 'utils/hsc2hs'
34

Build Working Copy

When
Completed at May 7 2018, 6:54 PM · Built for 3 h, 58 m
Status
Passed
Description

Lease a working copy for Linux/amd64 builds.