Build 45365

Properties

Drydock: Build

When
Completed at May 10 2018, 1:35 AM · Built for 45 m, 57 s
Status
Failed
Description

Run the build.

Build Log 267149 (remote - stderr)
25 - 50 - 100 - Unlimited Lines

756 Size = {terms: 619, types: 829, coercions: 9, joins: 0/27}
757Warning: -rtsopts and -with-rtsopts have no effect with -shared.
758 Call hs_init_ghc() from your main() function to set these options.
759Warning: -rtsopts and -with-rtsopts have no effect with -shared.
760 Call hs_init_ghc() from your main() function to set these options.
761Warning: -rtsopts and -with-rtsopts have no effect with -shared.
762 Call hs_init_ghc() from your main() function to set these options.
763Warning: -rtsopts and -with-rtsopts have no effect with -shared.
764 Call hs_init_ghc() from your main() function to set these options.
765Warning: -rtsopts and -with-rtsopts have no effect with -shared.
766 Call hs_init_ghc() from your main() function to set these options.
767Warning: -rtsopts and -with-rtsopts have no effect with -shared.
768 Call hs_init_ghc() from your main() function to set these options.
769
770compiler/coreSyn/CoreSeq.hs:73:1: error: [-Wincomplete-patterns, -Werror=incomplete-patterns]
771 Pattern match(es) are non-exhaustive
772 In an equation for ‘seqTickish’:
773 Patterns not matched: (WeightHint _)
774 |
77573 | seqTickish ProfNote{ profNoteCC = cc } = cc `seq` ()
776 | ^^^^^^^^^^^^^^^^^^^^^^^^^^^^^^^^^^^^^^^^^^^^^^^^^^^^...
777make[1]: *** [compiler/stage2/build/CoreSeq.o] Error 1
778make[1]: *** Waiting for unfinished jobs....
779make: *** [all] Error 2
780

Build Log 267148 (remote - stdout)
25 - 50 - 100 - Unlimited Lines

4705 HC [stage 1] compiler/stage2/build/Kind.o
4706 HC [stage 1] compiler/stage2/build/Type.o
4707 HC [stage 1] compiler/stage2/build/Coercion.o
4708 HC [stage 1] compiler/stage2/build/PatSyn.o
4709 HC [stage 1] compiler/stage2/build/Literal.o
4710 HC [stage 1] compiler/stage2/build/HsLit.o
4711 HC [stage 1] compiler/stage2/build/TrieMap.o
4712 HC [stage 1] compiler/stage2/build/Unify.o
4713 HC [stage 1] compiler/stage2/build/DataCon.o
4714 HC [stage 1] compiler/stage2/build/RepType.o
4715 HC [stage 1] compiler/stage2/build/Demand.o
4716 HC [stage 1] compiler/stage2/build/CoreSyn.o
4717 HC [stage 1] compiler/stage2/build/ConLike.o
4718 HC [stage 1] compiler/stage2/build/Vectorise/Type/Classify.o
4719 HC [stage 1] compiler/stage2/build/CoreMap.o
4720 HC [stage 1] compiler/stage2/build/Vectorise/Vect.o
4721 HC [stage 1] compiler/stage2/build/IdInfo.o
4722 HC [stage 1] compiler/stage2/build/Id.o
4723 HC [stage 1] compiler/stage2/build/TysWiredIn.o
4724 HC [stage 1] compiler/stage2/build/CoreStats.o
4725 HC [stage 1] compiler/stage2/build/HsTypes.o
4726 HC [stage 1] compiler/stage2/build/InteractiveEvalTypes.o
4727 HC [stage 1] compiler/stage2/build/CoreSeq.o
4728 HC [stage 1] compiler/stage2/build/UnVarGraph.o
4729

Drydock: Prepare tree

When
Completed at May 10 2018, 12:49 AM · Built for 10 s
Status
Passed

Build Log 267147 (remote - stderr)
25 - 50 - 100 - Unlimited Lines

1+ git clean -qxfd
2+ git submodule sync
3+ git submodule update --init --recursive
4+ git submodule foreach -q git clean -qxfd
5

Build Log 267146 (remote - stdout)
25 - 50 - 100 - Unlimited Lines

10Synchronizing submodule url for 'libraries/directory'
11Synchronizing submodule url for 'libraries/dph'
12Synchronizing submodule url for 'libraries/filepath'
13Synchronizing submodule url for 'libraries/haskeline'
14Synchronizing submodule url for 'libraries/hpc'
15Synchronizing submodule url for 'libraries/integer-gmp/gmp/gmp-tarballs'
16Synchronizing submodule url for 'libraries/mtl'
17Synchronizing submodule url for 'libraries/parallel'
18Synchronizing submodule url for 'libraries/parsec'
19Synchronizing submodule url for 'libraries/pretty'
20Synchronizing submodule url for 'libraries/primitive'
21Synchronizing submodule url for 'libraries/process'
22Synchronizing submodule url for 'libraries/random'
23Synchronizing submodule url for 'libraries/stm'
24Synchronizing submodule url for 'libraries/terminfo'
25Synchronizing submodule url for 'libraries/text'
26Synchronizing submodule url for 'libraries/time'
27Synchronizing submodule url for 'libraries/transformers'
28Synchronizing submodule url for 'libraries/unix'
29Synchronizing submodule url for 'libraries/vector'
30Synchronizing submodule url for 'libraries/xhtml'
31Synchronizing submodule url for 'nofib'
32Synchronizing submodule url for 'utils/haddock'
33Synchronizing submodule url for 'utils/hsc2hs'
34

Lease Working Copy

When
Completed at May 10 2018, 12:49 AM · Built for 2 d, 9 h
Status
Passed
Description

Lease a working copy for OSX/amd64 builds.