Build 45364

Properties

Drydock: Build

When
Completed at May 11 2018, 2:45 PM · Built for 50 m
Status
Failed

Build Log 267519 (remote - stderr)
25 - 50 - 100 - Unlimited Lines

683 Simplifier bailing out after 4 iterations [705, 14, 1, 4]
684 Size = {terms: 1,969, types: 2,087, coercions: 8, joins: 2/14}
685C:\msys64\var\drydock\workingcopy-121273\repo\glasgow-haskell-compiler\inplace\mingw\bin\ar.exe: creating libraries/directory/dist-install/build/libHSdirectory-1.3.2.3.a
686C:\msys64\var\drydock\workingcopy-121273\repo\glasgow-haskell-compiler\inplace\mingw\bin\ar.exe: creating libraries/binary/dist-install/build/libHSbinary-0.8.5.1.a
687C:\msys64\var\drydock\workingcopy-121273\repo\glasgow-haskell-compiler\inplace\mingw\bin\ar.exe: creating libraries/process/dist-install/build/libHSprocess-1.6.3.0.a
688C:\msys64\var\drydock\workingcopy-121273\repo\glasgow-haskell-compiler\inplace\mingw\bin\ar.exe: creating libraries/ghc-boot/dist-install/build/libHSghc-boot-8.5.a
689WARNING: file compiler\simplCore\SimplCore.hs, line 707
690 Simplifier bailing out after 4 iterations [57, 2, 1, 1]
691 Size = {terms: 687, types: 903, coercions: 12, joins: 0/27}
692C:\msys64\var\drydock\workingcopy-121273\repo\glasgow-haskell-compiler\inplace\mingw\bin\ar.exe: creating libraries/haskeline/dist-install/build/libHShaskeline-0.7.4.2.a
693C:\msys64\var\drydock\workingcopy-121273\repo\glasgow-haskell-compiler\inplace\mingw\bin\ar.exe: creating libraries/parsec/dist-install/build/libHSparsec-3.1.13.0.0.0.0.0.a
694C:\msys64\var\drydock\workingcopy-121273\repo\glasgow-haskell-compiler\inplace\mingw\bin\ar.exe: creating libraries/text/dist-install/build/libHStext-1.2.3.0.a
695C:\msys64\var\drydock\workingcopy-121273\repo\glasgow-haskell-compiler\inplace\mingw\bin\ar.exe: creating libraries/ghci/dist-install/build/libHSghci-8.5.a
696
697compiler\coreSyn\CoreSeq.hs:73:1: error: [-Wincomplete-patterns, -Werror=incomplete-patterns]
698 Pattern match(es) are non-exhaustive
699 In an equation for ‘seqTickish’:
700 Patterns not matched: (WeightHint _)
701 |
70273 | seqTickish ProfNote{ profNoteCC = cc } = cc `seq` ()
703 | ^^^^^^^^^^^^^^^^^^^^^^^^^^^^^^^^^^^^^^^^^^^^^^^^^^^^...
704make[1]: *** [compiler/ghc.mk:447: compiler/stage2/build/CoreSeq.o] Error 1
705make[1]: *** Waiting for unfinished jobs....
706make: *** [Makefile:127: all] Error 2
707

Build Log 267518 (remote - stdout)
25 - 50 - 100 - Unlimited Lines

5915 HC [stage 1] compiler/stage2/build/Kind.o
5916 HC [stage 1] compiler/stage2/build/Type.o
5917 HC [stage 1] compiler/stage2/build/Coercion.o
5918 HC [stage 1] compiler/stage2/build/PatSyn.o
5919 HC [stage 1] compiler/stage2/build/Literal.o
5920 HC [stage 1] compiler/stage2/build/HsLit.o
5921 HC [stage 1] compiler/stage2/build/TrieMap.o
5922 HC [stage 1] compiler/stage2/build/Unify.o
5923 HC [stage 1] compiler/stage2/build/DataCon.o
5924 HC [stage 1] compiler/stage2/build/RepType.o
5925 HC [stage 1] compiler/stage2/build/Demand.o
5926 HC [stage 1] compiler/stage2/build/CoreSyn.o
5927 HC [stage 1] compiler/stage2/build/ConLike.o
5928 HC [stage 1] compiler/stage2/build/Vectorise/Type/Classify.o
5929 HC [stage 1] compiler/stage2/build/CoreMap.o
5930 HC [stage 1] compiler/stage2/build/Vectorise/Vect.o
5931 HC [stage 1] compiler/stage2/build/IdInfo.o
5932 HC [stage 1] compiler/stage2/build/Id.o
5933 HC [stage 1] compiler/stage2/build/TysWiredIn.o
5934 HC [stage 1] compiler/stage2/build/CoreStats.o
5935 HC [stage 1] compiler/stage2/build/HsTypes.o
5936 HC [stage 1] compiler/stage2/build/InteractiveEvalTypes.o
5937 HC [stage 1] compiler/stage2/build/CoreSeq.o
5938 HC [stage 1] compiler/stage2/build/UnVarGraph.o
5939

Drydock: Prepare tree

When
Completed at May 11 2018, 1:55 PM · Built for 36 s
Status
Passed

Build Log 267517 (remote - stderr)
25 - 50 - 100 - Unlimited Lines

1+ git clean -qxfd
2+ git submodule foreach git checkout .
3+ git submodule foreach git clean -qxfd
4+ git submodule sync
5+ git submodule update --init --recursive
6+ git submodule foreach -q git clean -qxfd
7

Build Log 267516 (remote - stdout)
25 - 50 - 100 - Unlimited Lines

78Synchronizing submodule url for 'libraries/directory'
79Synchronizing submodule url for 'libraries/dph'
80Synchronizing submodule url for 'libraries/filepath'
81Synchronizing submodule url for 'libraries/haskeline'
82Synchronizing submodule url for 'libraries/hpc'
83Synchronizing submodule url for 'libraries/integer-gmp/gmp/gmp-tarballs'
84Synchronizing submodule url for 'libraries/mtl'
85Synchronizing submodule url for 'libraries/parallel'
86Synchronizing submodule url for 'libraries/parsec'
87Synchronizing submodule url for 'libraries/pretty'
88Synchronizing submodule url for 'libraries/primitive'
89Synchronizing submodule url for 'libraries/process'
90Synchronizing submodule url for 'libraries/random'
91Synchronizing submodule url for 'libraries/stm'
92Synchronizing submodule url for 'libraries/terminfo'
93Synchronizing submodule url for 'libraries/text'
94Synchronizing submodule url for 'libraries/time'
95Synchronizing submodule url for 'libraries/transformers'
96Synchronizing submodule url for 'libraries/unix'
97Synchronizing submodule url for 'libraries/vector'
98Synchronizing submodule url for 'libraries/xhtml'
99Synchronizing submodule url for 'nofib'
100Synchronizing submodule url for 'utils/haddock'
101Synchronizing submodule url for 'utils/hsc2hs'
102

Lease Working Copy

When
Completed at May 11 2018, 1:55 PM · Built for 3 d, 22 h
Status
Passed