Build 43270

Properties

Drydock: Build

When
Completed at Mar 27 2018, 9:48 PM · Built for 37 m, 10 s
Status
Failed

Build Log 257281 (remote - stderr)
25 - 50 - 100 - Unlimited Lines

477WARNING: file compiler/simplCore/SimplCore.hs, line 1025
478 Not shorting out: happySpecReduce_2
479WARNING: file compiler/simplCore/SimplCore.hs, line 1025
480 Not shorting out: happyGoto
481ar: creating libraries/terminfo/dist-install/build/libHSterminfo-0.4.1.1.a
482ar: creating libraries/transformers/dist-install/build/libHStransformers-0.5.5.0.a
483Warning: -rtsopts and -with-rtsopts have no effect with -shared.
484 Call hs_init_ghc() from your main() function to set these options.
485Warning: -rtsopts and -with-rtsopts have no effect with -shared.
486 Call hs_init_ghc() from your main() function to set these options.
487Warning: -rtsopts and -with-rtsopts have no effect with -shared.
488 Call hs_init_ghc() from your main() function to set these options.
489Warning: -rtsopts and -with-rtsopts have no effect with -shared.
490 Call hs_init_ghc() from your main() function to set these options.
491Warning: -rtsopts and -with-rtsopts have no effect with -shared.
492 Call hs_init_ghc() from your main() function to set these options.
493ar: creating libraries/mtl/dist-install/build/libHSmtl-2.2.2.a
494ar: creating libraries/process/dist-install/build/libHSprocess-1.6.3.0.a
495ar: creating libraries/pretty/dist-install/build/libHSpretty-1.1.3.6.a
496ar: creating libraries/xhtml/dist-install/build/libHSxhtml-3000.2.2.a
497ar: creating libraries/array/dist-install/build/libHSarray-0.5.2.0.a
498Warning: -rtsopts and -with-rtsopts have no effect with -shared.
499 Call hs_init_ghc() from your main() function to set these options.
500ar: creating libraries/stm/dist-install/build/libHSstm-2.4.5.0.a
501Warning: -rtsopts and -with-rtsopts have no effect with -shared.
502 Call hs_init_ghc() from your main() function to set these options.
503Warning: -rtsopts and -with-rtsopts have no effect with -shared.
504 Call hs_init_ghc() from your main() function to set these options.
505Warning: -rtsopts and -with-rtsopts have no effect with -shared.
506 Call hs_init_ghc() from your main() function to set these options.
507ar: creating libraries/ghc-compact/dist-install/build/libHSghc-compact-0.1.0.0.a
508Warning: -rtsopts and -with-rtsopts have no effect with -shared.
509 Call hs_init_ghc() from your main() function to set these options.
510Warning: -rtsopts and -with-rtsopts have no effect with -shared.
511 Call hs_init_ghc() from your main() function to set these options.
512ar: creating libraries/template-haskell/dist-install/build/libHStemplate-haskell-2.13.0.0.a
513ar: creating libraries/unix/dist-install/build/libHSunix-2.7.2.2.a
514Warning: -rtsopts and -with-rtsopts have no effect with -shared.
515 Call hs_init_ghc() from your main() function to set these options.
516ar: creating libraries/containers/dist-install/build/libHScontainers-0.5.11.0.a
517Warning: -rtsopts and -with-rtsopts have no effect with -shared.
518 Call hs_init_ghc() from your main() function to set these options.
519ar: creating libraries/bytestring/dist-install/build/libHSbytestring-0.10.8.2.a
520Warning: -rtsopts and -with-rtsopts have no effect with -shared.
521 Call hs_init_ghc() from your main() function to set these options.
522Warning: -rtsopts and -with-rtsopts have no effect with -shared.
523 Call hs_init_ghc() from your main() function to set these options.
524ar: creating libraries/time/dist-install/build/libHStime-1.8.0.2.a
525Warning: -rtsopts and -with-rtsopts have no effect with -shared.
526 Call hs_init_ghc() from your main() function to set these options.
527Warning: -rtsopts and -with-rtsopts have no effect with -shared.
528 Call hs_init_ghc() from your main() function to set these options.
529ar: creating libraries/hpc/dist-install/build/libHShpc-0.6.0.3.a
530WARNING: file compiler/simplCore/SimplCore.hs, line 706
531 Simplifier bailing out after 4 iterations [705, 14, 1, 4]
532 Size = {terms: 1,969, types: 2,087, coercions: 8, joins: 2/14}
533Warning: -rtsopts and -with-rtsopts have no effect with -shared.
534 Call hs_init_ghc() from your main() function to set these options.
535ar: creating libraries/directory/dist-install/build/libHSdirectory-1.3.1.5.a
536Warning: -rtsopts and -with-rtsopts have no effect with -shared.
537 Call hs_init_ghc() from your main() function to set these options.
538Warning: -rtsopts and -with-rtsopts have no effect with -shared.
539 Call hs_init_ghc() from your main() function to set these options.
540WARNING: file compiler/simplCore/SimplCore.hs, line 706
541 Simplifier bailing out after 4 iterations [47, 2, 1, 1]
542 Size = {terms: 619, types: 829, coercions: 9, joins: 0/27}
543Warning: -rtsopts and -with-rtsopts have no effect with -shared.
544 Call hs_init_ghc() from your main() function to set these options.
545ar: creating libraries/ghc-boot/dist-install/build/libHSghc-boot-8.5.a
546ar: creating libraries/binary/dist-install/build/libHSbinary-0.8.5.1.a
547Warning: -rtsopts and -with-rtsopts have no effect with -shared.
548 Call hs_init_ghc() from your main() function to set these options.
549ar: creating libraries/haskeline/dist-install/build/libHShaskeline-0.7.4.2.a
550Warning: -rtsopts and -with-rtsopts have no effect with -shared.
551 Call hs_init_ghc() from your main() function to set these options.
552ar: creating libraries/parsec/dist-install/build/libHSparsec-3.1.13.0.a
553ar: creating libraries/text/dist-install/build/libHStext-1.2.3.0.a
554Warning: -rtsopts and -with-rtsopts have no effect with -shared.
555 Call hs_init_ghc() from your main() function to set these options.
556Warning: -rtsopts and -with-rtsopts have no effect with -shared.
557 Call hs_init_ghc() from your main() function to set these options.
558ar: creating libraries/ghci/dist-install/build/libHSghci-8.5.a
559Warning: -rtsopts and -with-rtsopts have no effect with -shared.
560 Call hs_init_ghc() from your main() function to set these options.
561
562compiler/ghci/RtClosureInspect.hs:191:47: error: [-Wunused-matches, -Werror=unused-matches]
563 Defined but not used: ‘t’
564 |
565191 | itbl@(InfoTable.StgInfoTable _ _ _ t _ _) <- peekItbl iptr1
566 | ^
567
568compiler/ghci/RtClosureInspect.hs:1313:1: error: [-Wunused-top-binds, -Werror=unused-top-binds]
569 Defined but not used: ‘amap'’
570 |
5711313 | amap' f (Array i0 i _ arr#) = map g [0 .. i - i0]
572 | ^^^^^
573make[1]: *** [compiler/stage2/build/RtClosureInspect.o] Error 1
574make[1]: *** Waiting for unfinished jobs....
575make: *** [all] Error 2
576

Build Log 257280 (remote - stdout)
25 - 50 - 100 - Unlimited Lines

5038 HC [stage 1] compiler/stage2/build/ByteCodeItbls.o
5039 HC [stage 1] compiler/stage2/build/ByteCodeLink.o
5040 HC [stage 1] compiler/stage2/build/ToIface.o
5041 HC [stage 1] compiler/stage2/build/UnariseStg.o
5042 HC [stage 1] compiler/stage2/build/CoreToStg.o
5043 HC [stage 1] compiler/stage2/build/WwLib.o
5044 HC [stage 1] compiler/stage2/build/Coverage.o
5045 HC [stage 1] libraries/Cabal/Cabal/dist-install/build/Distribution/InstalledPackageInfo.o
5046 HC [stage 1] libraries/Cabal/Cabal/dist-install/build/Distribution/Types/PackageDescription.o
5047 HC [stage 1] compiler/stage2/build/LoadIface.o-boot
5048 HC [stage 1] compiler/stage2/build/IfaceEnv.o
5049 HC [stage 1] compiler/stage2/build/TcMType.o
5050 HC [stage 1] compiler/stage2/build/RnUnbound.o
5051 HC [stage 1] compiler/stage2/build/ByteCodeAsm.o
5052 HC [stage 1] compiler/stage2/build/RnSplice.o-boot
5053 HC [stage 1] compiler/stage2/build/TcAnnotations.o
5054 HC [stage 1] compiler/stage2/build/TcPatSyn.o-boot
5055 HC [stage 1] compiler/stage2/build/StgCmmCon.o
5056 HC [stage 1] compiler/stage2/build/SimplStg.o
5057 HC [stage 1] compiler/stage2/build/WorkWrap.o
5058 HC [stage 1] compiler/stage2/build/DmdAnal.o
5059 HC [stage 1] libraries/Cabal/Cabal/dist-install/build/Distribution/Simple/PackageIndex.o
5060 HC [stage 1] libraries/Cabal/Cabal/dist-install/build/Distribution/Backpack/ModuleShape.o
5061 HC [stage 1] libraries/Cabal/Cabal/dist-install/build/Distribution/Simple/Program/HcPkg.o
5062 HC [stage 1] libraries/Cabal/Cabal/dist-install/build/Distribution/Simple/GHC/IPI642.o
5063 HC [stage 1] compiler/stage2/build/NameShape.o
5064 HC [stage 1] compiler/stage2/build/BinIface.o
5065 HC [stage 1] compiler/stage2/build/TcHsSyn.o
5066 HC [stage 1] compiler/stage2/build/BuildTyCl.o
5067 HC [stage 1] compiler/stage2/build/StgCmmExpr.o
5068 HC [stage 1] compiler/stage2/build/ByteCodeGen.o
5069 HC [stage 1] compiler/stage2/build/DebuggerUtils.o
5070 HC [stage 1] libraries/Cabal/Cabal/dist-install/build/Distribution/Types/GenericPackageDescription.o
5071 HC [stage 1] libraries/Cabal/Cabal/dist-install/build/Distribution/Backpack/PreModuleShape.o
5072 HC [stage 1] libraries/Cabal/Cabal/dist-install/build/Distribution/Backpack/PreExistingComponent.o
5073 HC [stage 1] libraries/Cabal/Cabal/dist-install/build/Distribution/Types/PackageDescription/Lens.o
5074 HC [stage 1] compiler/stage2/build/RnModIface.o
5075 HC [stage 1] compiler/stage2/build/FlagChecker.o
5076 HC [stage 1] compiler/stage2/build/StgCmmBind.o
5077 HC [stage 1] compiler/stage2/build/TmOracle.o
5078 HC [stage 1] utils/ghc-pkg/dist-install/build/Main.dyn_o
5079 HC [stage 1] compiler/stage2/build/LoadIface.o
5080 HC [stage 1] libraries/Cabal/Cabal/dist-install/build/Distribution/PackageDescription.o
5081 HC [stage 1] libraries/Cabal/Cabal/dist-install/build/Distribution/Types/GenericPackageDescription/Lens.o
5082 HC [stage 1] libraries/Cabal/Cabal/dist-install/build/Distribution/Parsec/ConfVar.o
5083 HC [stage 1] compiler/stage2/build/CmmParse.o
5084 HC [stage 1] compiler/stage2/build/StgCmm.o
5085 HC [stage 1] libraries/Cabal/Cabal/dist-install/build/Distribution/Types/ComponentLocalBuildInfo.o
5086 HC [stage 1] libraries/Cabal/Cabal/dist-install/build/Distribution/Simple/Setup.o
5087 HC [stage 1] libraries/Cabal/Cabal/dist-install/build/Distribution/Simple/BuildToolDepends.o
5088 HC [stage 1] libraries/Cabal/Cabal/dist-install/build/Distribution/Backpack/UnifyM.o
5089 HC [stage 1] libraries/Cabal/Cabal/dist-install/build/Distribution/PackageDescription/Configuration.o
5090 HC [stage 1] libraries/Cabal/Cabal/dist-install/build/Distribution/Types/Lens.o
5091 HC [stage 1] compiler/stage2/build/TcEnv.o
5092 HC [stage 1] compiler/stage2/build/RnFixity.o
5093 HC [stage 1] compiler/stage2/build/Linker.o
5094 HC [stage 1] compiler/stage2/build/MkIface.o
5095 HC [stage 1] compiler/stage2/build/FamInst.o
5096 HC [stage 1] libraries/Cabal/Cabal/dist-install/build/Distribution/Types/TargetInfo.o
5097 HC [stage 1] libraries/Cabal/Cabal/dist-install/build/Distribution/Backpack/MixLink.o
5098 HC [stage 1] libraries/Cabal/Cabal/dist-install/build/Distribution/PackageDescription/FieldGrammar.o
5099 HC [stage 1] compiler/stage2/build/CoreMonad.o
5100 HC [stage 1] compiler/stage2/build/RnUtils.o
5101 HC [stage 1] compiler/stage2/build/PprTyThing.o
5102 HC [stage 1] compiler/stage2/build/FunDeps.o
5103 HC [stage 1] compiler/stage2/build/StaticPtrTable.o
5104 HC [stage 1] compiler/stage2/build/Plugins.o
5105 HC [stage 1] compiler/stage2/build/RnEnv.o
5106 HC [stage 1] compiler/stage2/build/Inst.o
5107 HC [stage 1] compiler/stage2/build/CoreLint.o
5108 HC [stage 1] compiler/stage2/build/SpecConstr.o
5109 HC [stage 1] compiler/stage2/build/Specialise.o
5110 HC [stage 1] compiler/stage2/build/SetLevels.o
5111 HC [stage 1] compiler/stage2/build/FloatIn.o
5112 HC [stage 1] compiler/stage2/build/SimplMonad.o
5113 HC [stage 1] libraries/Cabal/Cabal/dist-install/build/Distribution/PackageDescription/PrettyPrint.o
5114 HC [stage 1] libraries/Cabal/Cabal/dist-install/build/Distribution/PackageDescription/Parsec.o
5115 HC [stage 1] compiler/stage2/build/RnNames.o
5116 HC [stage 1] compiler/stage2/build/RnTypes.o
5117 HC [stage 1] compiler/stage2/build/TcUnify.o
5118 HC [stage 1] compiler/stage2/build/TcIface.o
5119 HC [stage 1] compiler/stage2/build/CorePrep.o
5120 HC [stage 1] compiler/stage2/build/FloatOut.o
5121 HC [stage 1] compiler/stage2/build/SimplEnv.o
5122 HC [stage 1] compiler/stage2/build/GhcPlugins.o
5123 HC [stage 1] libraries/Cabal/Cabal/dist-install/build/Distribution/Types/LocalBuildInfo.o
5124 HC [stage 1] libraries/Cabal/Cabal/dist-install/build/Distribution/Make.o
5125 HC [stage 1] libraries/Cabal/Cabal/dist-install/build/Distribution/Simple/Program/GHC.o
5126 HC [stage 1] compiler/stage2/build/DynamicLoading.o
5127 HC [stage 1] compiler/stage2/build/RnPat.o
5128 HC [stage 1] compiler/stage2/build/TcErrors.o
5129 HC [stage 1] compiler/stage2/build/TcRnExports.o
5130 HC [stage 1] compiler/stage2/build/DsMonad.o
5131 HC [stage 1] compiler/stage2/build/TidyPgm.o
5132 HC [stage 1] compiler/stage2/build/SimplUtils.o
5133 HC [stage 1] compiler/stage2/build/RtClosureInspect.o
5134 HC [stage 1] libraries/Cabal/Cabal/dist-install/build/Distribution/Simple/LocalBuildInfo.o
5135compiler/ghc.mk:447: recipe for target 'compiler/stage2/build/RtClosureInspect.o' failed
5136Makefile:122: recipe for target 'all' failed
5137

Drydock: Prepare tree

When
Completed at Mar 27 2018, 9:11 PM · Built for 4 s
Status
Passed

Build Log 257279 (remote - stderr)
25 - 50 - 100 - Unlimited Lines

1+ git clean -qxfd
2+ git submodule sync
3+ git submodule update --init --recursive
4+ git submodule foreach -q git clean -qxfd
5

Build Log 257278 (remote - stdout)
25 - 50 - 100 - Unlimited Lines

1Synchronizing submodule url for '.arc-linters/arcanist-external-json-linter'
2Synchronizing submodule url for 'hadrian'
3Synchronizing submodule url for 'libffi-tarballs'
4Synchronizing submodule url for 'libraries/Cabal'
5Synchronizing submodule url for 'libraries/Win32'
6Synchronizing submodule url for 'libraries/array'
7Synchronizing submodule url for 'libraries/binary'
8Synchronizing submodule url for 'libraries/bytestring'
9Synchronizing submodule url for 'libraries/containers'
10Synchronizing submodule url for 'libraries/deepseq'
11Synchronizing submodule url for 'libraries/directory'
12Synchronizing submodule url for 'libraries/dph'
13Synchronizing submodule url for 'libraries/filepath'
14Synchronizing submodule url for 'libraries/haskeline'
15Synchronizing submodule url for 'libraries/hpc'
16Synchronizing submodule url for 'libraries/integer-gmp/gmp/gmp-tarballs'
17Synchronizing submodule url for 'libraries/mtl'
18Synchronizing submodule url for 'libraries/parallel'
19Synchronizing submodule url for 'libraries/parsec'
20Synchronizing submodule url for 'libraries/pretty'
21Synchronizing submodule url for 'libraries/primitive'
22Synchronizing submodule url for 'libraries/process'
23Synchronizing submodule url for 'libraries/random'
24Synchronizing submodule url for 'libraries/stm'
25Synchronizing submodule url for 'libraries/terminfo'
26Synchronizing submodule url for 'libraries/text'
27Synchronizing submodule url for 'libraries/time'
28Synchronizing submodule url for 'libraries/transformers'
29Synchronizing submodule url for 'libraries/unix'
30Synchronizing submodule url for 'libraries/vector'
31Synchronizing submodule url for 'libraries/xhtml'
32Synchronizing submodule url for 'nofib'
33Synchronizing submodule url for 'utils/haddock'
34Synchronizing submodule url for 'utils/hsc2hs'
35

Build Working Copy

When
Completed at Mar 27 2018, 9:11 PM · Built instantly
Status
Passed
Description

Lease a working copy for Linux/amd64 builds.