Build 43270

Properties

Drydock: Build

When
Completed at Mar 27 2018, 9:48 PM · Built for 37 m, 10 s
Status
Failed

Build Log 257281 (remote - stderr)
25 - 50 - 100 - Unlimited Lines

552ar: creating libraries/parsec/dist-install/build/libHSparsec-3.1.13.0.a
553ar: creating libraries/text/dist-install/build/libHStext-1.2.3.0.a
554Warning: -rtsopts and -with-rtsopts have no effect with -shared.
555 Call hs_init_ghc() from your main() function to set these options.
556Warning: -rtsopts and -with-rtsopts have no effect with -shared.
557 Call hs_init_ghc() from your main() function to set these options.
558ar: creating libraries/ghci/dist-install/build/libHSghci-8.5.a
559Warning: -rtsopts and -with-rtsopts have no effect with -shared.
560 Call hs_init_ghc() from your main() function to set these options.
561
562compiler/ghci/RtClosureInspect.hs:191:47: error: [-Wunused-matches, -Werror=unused-matches]
563 Defined but not used: ‘t’
564 |
565191 | itbl@(InfoTable.StgInfoTable _ _ _ t _ _) <- peekItbl iptr1
566 | ^
567
568compiler/ghci/RtClosureInspect.hs:1313:1: error: [-Wunused-top-binds, -Werror=unused-top-binds]
569 Defined but not used: ‘amap'’
570 |
5711313 | amap' f (Array i0 i _ arr#) = map g [0 .. i - i0]
572 | ^^^^^
573make[1]: *** [compiler/stage2/build/RtClosureInspect.o] Error 1
574make[1]: *** Waiting for unfinished jobs....
575make: *** [all] Error 2
576

Build Log 257280 (remote - stdout)
25 - 50 - 100 - Unlimited Lines

5113 HC [stage 1] libraries/Cabal/Cabal/dist-install/build/Distribution/PackageDescription/PrettyPrint.o
5114 HC [stage 1] libraries/Cabal/Cabal/dist-install/build/Distribution/PackageDescription/Parsec.o
5115 HC [stage 1] compiler/stage2/build/RnNames.o
5116 HC [stage 1] compiler/stage2/build/RnTypes.o
5117 HC [stage 1] compiler/stage2/build/TcUnify.o
5118 HC [stage 1] compiler/stage2/build/TcIface.o
5119 HC [stage 1] compiler/stage2/build/CorePrep.o
5120 HC [stage 1] compiler/stage2/build/FloatOut.o
5121 HC [stage 1] compiler/stage2/build/SimplEnv.o
5122 HC [stage 1] compiler/stage2/build/GhcPlugins.o
5123 HC [stage 1] libraries/Cabal/Cabal/dist-install/build/Distribution/Types/LocalBuildInfo.o
5124 HC [stage 1] libraries/Cabal/Cabal/dist-install/build/Distribution/Make.o
5125 HC [stage 1] libraries/Cabal/Cabal/dist-install/build/Distribution/Simple/Program/GHC.o
5126 HC [stage 1] compiler/stage2/build/DynamicLoading.o
5127 HC [stage 1] compiler/stage2/build/RnPat.o
5128 HC [stage 1] compiler/stage2/build/TcErrors.o
5129 HC [stage 1] compiler/stage2/build/TcRnExports.o
5130 HC [stage 1] compiler/stage2/build/DsMonad.o
5131 HC [stage 1] compiler/stage2/build/TidyPgm.o
5132 HC [stage 1] compiler/stage2/build/SimplUtils.o
5133 HC [stage 1] compiler/stage2/build/RtClosureInspect.o
5134 HC [stage 1] libraries/Cabal/Cabal/dist-install/build/Distribution/Simple/LocalBuildInfo.o
5135compiler/ghc.mk:447: recipe for target 'compiler/stage2/build/RtClosureInspect.o' failed
5136Makefile:122: recipe for target 'all' failed
5137

Drydock: Prepare tree

When
Completed at Mar 27 2018, 9:11 PM · Built for 4 s
Status
Passed

Build Log 257279 (remote - stderr)
25 - 50 - 100 - Unlimited Lines

1+ git clean -qxfd
2+ git submodule sync
3+ git submodule update --init --recursive
4+ git submodule foreach -q git clean -qxfd
5

Build Log 257278 (remote - stdout)
25 - 50 - 100 - Unlimited Lines

10Synchronizing submodule url for 'libraries/directory'
11Synchronizing submodule url for 'libraries/dph'
12Synchronizing submodule url for 'libraries/filepath'
13Synchronizing submodule url for 'libraries/haskeline'
14Synchronizing submodule url for 'libraries/hpc'
15Synchronizing submodule url for 'libraries/integer-gmp/gmp/gmp-tarballs'
16Synchronizing submodule url for 'libraries/mtl'
17Synchronizing submodule url for 'libraries/parallel'
18Synchronizing submodule url for 'libraries/parsec'
19Synchronizing submodule url for 'libraries/pretty'
20Synchronizing submodule url for 'libraries/primitive'
21Synchronizing submodule url for 'libraries/process'
22Synchronizing submodule url for 'libraries/random'
23Synchronizing submodule url for 'libraries/stm'
24Synchronizing submodule url for 'libraries/terminfo'
25Synchronizing submodule url for 'libraries/text'
26Synchronizing submodule url for 'libraries/time'
27Synchronizing submodule url for 'libraries/transformers'
28Synchronizing submodule url for 'libraries/unix'
29Synchronizing submodule url for 'libraries/vector'
30Synchronizing submodule url for 'libraries/xhtml'
31Synchronizing submodule url for 'nofib'
32Synchronizing submodule url for 'utils/haddock'
33Synchronizing submodule url for 'utils/hsc2hs'
34

Build Working Copy

When
Completed at Mar 27 2018, 9:11 PM · Built instantly
Status
Passed
Description

Lease a working copy for Linux/amd64 builds.