Build 43269

Properties

Drydock: Build

When
Completed at Mar 30 2018, 1:58 PM · Built for 55 m, 40 s
Status
Failed
Description

Run the build.

Build Log 258021 (remote - stderr)
25 - 50 - 100 - Unlimited Lines

682 Call hs_init_ghc() from your main() function to set these options.
683Warning: -rtsopts and -with-rtsopts have no effect with -shared.
684 Call hs_init_ghc() from your main() function to set these options.
685Warning: -rtsopts and -with-rtsopts have no effect with -shared.
686 Call hs_init_ghc() from your main() function to set these options.
687Warning: -rtsopts and -with-rtsopts have no effect with -shared.
688 Call hs_init_ghc() from your main() function to set these options.
689Warning: -rtsopts and -with-rtsopts have no effect with -shared.
690 Call hs_init_ghc() from your main() function to set these options.
691
692compiler/ghci/RtClosureInspect.hs:191:47: error: [-Wunused-matches, -Werror=unused-matches]
693 Defined but not used: ‘t’
694 |
695191 | itbl@(InfoTable.StgInfoTable _ _ _ t _ _) <- peekItbl iptr1
696 | ^
697
698compiler/ghci/RtClosureInspect.hs:1315:1: error: [-Wunused-top-binds, -Werror=unused-top-binds]
699 Defined but not used: ‘amap'’
700 |
7011315 | (# e #) -> f e
702 | ^^^^^
703make[1]: *** [compiler/stage2/build/RtClosureInspect.o] Error 1
704make[1]: *** Waiting for unfinished jobs....
705make: *** [all] Error 2
706

Build Log 258020 (remote - stdout)
25 - 50 - 100 - Unlimited Lines

5044 HC [stage 1] compiler/stage2/build/SimplMonad.o
5045 HC [stage 1] libraries/Cabal/Cabal/dist-install/build/Distribution/Simple/LocalBuildInfo.o
5046 HC [stage 1] compiler/stage2/build/RnNames.o
5047 HC [stage 1] compiler/stage2/build/RnTypes.o
5048 HC [stage 1] compiler/stage2/build/TcUnify.o
5049 HC [stage 1] compiler/stage2/build/FloatOut.o
5050 HC [stage 1] compiler/stage2/build/SimplEnv.o
5051 HC [stage 1] compiler/stage2/build/GhcPlugins.o
5052 HC [stage 1] libraries/Cabal/Cabal/dist-install/build/Distribution/Backpack/Id.o
5053 HC [stage 1] libraries/Cabal/Cabal/dist-install/build/Distribution/Backpack/ComponentsGraph.o
5054 HC [stage 1] libraries/Cabal/Cabal/dist-install/build/Distribution/Simple/BuildPaths.o
5055 HC [stage 1] libraries/Cabal/Cabal/dist-install/build/Distribution/Simple/Program/Ld.o
5056 HC [stage 1] libraries/Cabal/Cabal/dist-install/build/Distribution/Simple/Program/Ar.o
5057 HC [stage 1] libraries/Cabal/Cabal/dist-install/build/Distribution/Simple/Hpc.o
5058 HC [stage 1] libraries/Cabal/Cabal/dist-install/build/Distribution/Simple/BuildTarget.o
5059 HC [stage 1] libraries/Cabal/Cabal/dist-install/build/Distribution/Simple/Test/Log.o
5060 HC [stage 1] libraries/Cabal/Cabal/dist-install/build/Distribution/Simple/Build/Macros.o
5061 HC [stage 1] compiler/stage2/build/TcErrors.o
5062 HC [stage 1] compiler/stage2/build/TcIface.o
5063 HC [stage 1] compiler/stage2/build/CorePrep.o
5064 HC [stage 1] compiler/stage2/build/SimplUtils.o
5065 HC [stage 1] compiler/stage2/build/RtClosureInspect.o
5066 HC [stage 1] libraries/Cabal/Cabal/dist-install/build/Distribution/Backpack/ConfiguredComponent.o
5067 HC [stage 1] libraries/Cabal/Cabal/dist-install/build/Distribution/PackageDescription/Check.o
5068

Drydock: Prepare tree

When
Completed at Mar 30 2018, 1:02 PM · Built for 12 s
Status
Passed

Build Log 258019 (remote - stderr)
25 - 50 - 100 - Unlimited Lines

1+ git clean -qxfd
2+ git submodule sync
3+ git submodule update --init --recursive
4+ git submodule foreach -q git clean -qxfd
5

Build Log 258018 (remote - stdout)
25 - 50 - 100 - Unlimited Lines

17Synchronizing submodule url for 'libraries/parallel'
18Synchronizing submodule url for 'libraries/parsec'
19Synchronizing submodule url for 'libraries/pretty'
20Synchronizing submodule url for 'libraries/primitive'
21Synchronizing submodule url for 'libraries/process'
22Synchronizing submodule url for 'libraries/random'
23Synchronizing submodule url for 'libraries/stm'
24Synchronizing submodule url for 'libraries/terminfo'
25Synchronizing submodule url for 'libraries/text'
26Synchronizing submodule url for 'libraries/time'
27Synchronizing submodule url for 'libraries/transformers'
28Synchronizing submodule url for 'libraries/unix'
29Synchronizing submodule url for 'libraries/vector'
30Synchronizing submodule url for 'libraries/xhtml'
31Synchronizing submodule url for 'nofib'
32Synchronizing submodule url for 'utils/haddock'
33Synchronizing submodule url for 'utils/hsc2hs'
34Submodule path 'hadrian': checked out 'da397291a9052387862c27c87ec29b6fce2c7d77'
35Submodule path 'libraries/Cabal': checked out 'c219cd3f31c8e4e4bc71f93bbcd4de87830a986d'
36Submodule path 'libraries/array': checked out '1d0435f4937f03901e32304e279f46ce19b0f089'
37Submodule path 'libraries/unix': checked out '41c5776162b60e0739a7559ceab03b9c3a444516'
38Submodule path 'nofib': checked out '1364fe623f9216108a285a8804a27bdd8dfea3c4'
39Submodule path 'utils/haddock': checked out '067d52fd4be15a1842cbb05f42d9d482de0ad3a7'
40Submodule path 'utils/hsc2hs': checked out 'b8588039f3810e2d0f52e9afdb15998992ee38b1'
41

Lease Working Copy

When
Completed at Mar 30 2018, 1:02 PM · Built instantly
Status
Passed
Description

Lease a working copy for OSX/amd64 builds.