Build 43268

Properties

Drydock: Build

When
Completed at Mar 27 2018, 9:05 AM · Built for 55 m, 48 s
Status
Failed

Build Log 257095 (remote - stderr)
25 - 50 - 100 - Unlimited Lines

523C:/msys64/var/drydock/workingcopy-121270/repo/glasgow-haskell-compiler/docs/users_guide/separate_compilation.rst:611: WARNING: Could not lex literal_block as "haskell". Highlighting skipped.
524Warning: -rtsopts and -with-rtsopts have no effect with -no-hs-main.
525 Call hs_init_ghc() from your main() function to set these options.
526Warning: -rtsopts and -with-rtsopts have no effect with -no-hs-main.
527 Call hs_init_ghc() from your main() function to set these options.
528Warning: -rtsopts and -with-rtsopts have no effect with -no-hs-main.
529 Call hs_init_ghc() from your main() function to set these options.
530C:\msys64\var\drydock\workingcopy-121270\repo\glasgow-haskell-compiler\inplace\mingw\bin\ar.exe: creating rts/dist/build/libHSrts.a
531C:\msys64\var\drydock\workingcopy-121270\repo\glasgow-haskell-compiler\inplace\mingw\bin\ar.exe: creating rts/dist/build/libHSrts_l.a
532C:\msys64\var\drydock\workingcopy-121270\repo\glasgow-haskell-compiler\inplace\mingw\bin\ar.exe: creating rts/dist/build/libHSrts_debug.a
533C:\msys64\var\drydock\workingcopy-121270\repo\glasgow-haskell-compiler\inplace\mingw\bin\ar.exe: creating rts/dist/build/libHSrts_thr_debug.a
534C:\msys64\var\drydock\workingcopy-121270\repo\glasgow-haskell-compiler\inplace\mingw\bin\ar.exe: creating rts/dist/build/libHSrts_thr.a
535C:\msys64\var\drydock\workingcopy-121270\repo\glasgow-haskell-compiler\inplace\mingw\bin\ar.exe: creating rts/dist/build/libHSrts_thr_l.a
536C:\msys64\var\drydock\workingcopy-121270\repo\glasgow-haskell-compiler\inplace\mingw\bin\ar.exe: creating libraries/ghc-prim/dist-install/build/libHSghc-prim-0.5.2.0.a
537C:\msys64\var\drydock\workingcopy-121270\repo\glasgow-haskell-compiler\inplace\mingw\bin\ar.exe: creating libraries/integer-gmp/dist-install/build/libHSinteger-gmp-1.0.1.0.a
538WARNING: file compiler\stgSyn\CoreToStg.hs, line 337
539 joinLines_s4fA True False
540C:\msys64\var\drydock\workingcopy-121270\repo\glasgow-haskell-compiler\inplace\mingw\bin\ar.exe: creating libraries/ghc-boot-th/dist-install/build/libHSghc-boot-th-8.5.a
541C:\msys64\var\drydock\workingcopy-121270\repo\glasgow-haskell-compiler\inplace\mingw\bin\ar.exe: creating libraries/filepath/dist-install/build/libHSfilepath-1.4.2.a
542WARNING: file compiler\simplCore\SimplCore.hs, line 1025
543 Not shorting out: happyReduce
544WARNING: file compiler\simplCore\SimplCore.hs, line 1025
545 Not shorting out: happyDoAction
546WARNING: file compiler\simplCore\SimplCore.hs, line 1025
547 Not shorting out: happyShift
548WARNING: file compiler\simplCore\SimplCore.hs, line 1025
549 Not shorting out: happyFail
550WARNING: file compiler\simplCore\SimplCore.hs, line 1025
551 Not shorting out: happySpecReduce_3
552WARNING: file compiler\simplCore\SimplCore.hs, line 1025
553 Not shorting out: happySpecReduce_1
554WARNING: file compiler\simplCore\SimplCore.hs, line 1025
555 Not shorting out: happySpecReduce_0
556WARNING: file compiler\simplCore\SimplCore.hs, line 1025
557 Not shorting out: happySpecReduce_2
558WARNING: file compiler\simplCore\SimplCore.hs, line 1025
559 Not shorting out: happyGoto
560WARNING: file compiler\simplCore\SimplCore.hs, line 1025
561 Not shorting out: happyReduce
562WARNING: file compiler\simplCore\SimplCore.hs, line 1025
563 Not shorting out: happyDoAction
564WARNING: file compiler\simplCore\SimplCore.hs, line 1025
565 Not shorting out: happyShift
566WARNING: file compiler\simplCore\SimplCore.hs, line 1025
567 Not shorting out: happyFail
568WARNING: file compiler\simplCore\SimplCore.hs, line 1025
569 Not shorting out: happySpecReduce_3
570WARNING: file compiler\simplCore\SimplCore.hs, line 1025
571 Not shorting out: happySpecReduce_1
572WARNING: file compiler\simplCore\SimplCore.hs, line 1025
573 Not shorting out: happySpecReduce_0
574WARNING: file compiler\simplCore\SimplCore.hs, line 1025
575 Not shorting out: happySpecReduce_2
576WARNING: file compiler\simplCore\SimplCore.hs, line 1025
577 Not shorting out: happyGoto
578C:\msys64\var\drydock\workingcopy-121270\repo\glasgow-haskell-compiler\inplace\mingw\bin\ar.exe: creating libraries/deepseq/dist-install/build/libHSdeepseq-1.4.3.0.a
579C:\msys64\var\drydock\workingcopy-121270\repo\glasgow-haskell-compiler\inplace\mingw\bin\ar.exe: creating libraries/transformers/dist-install/build/libHStransformers-0.5.5.0.a
580C:\msys64\var\drydock\workingcopy-121270\repo\glasgow-haskell-compiler\inplace\mingw\bin\ar.exe: creating libraries/base/dist-install/build/libHSbase-4.11.0.0.a
581C:\msys64\var\drydock\workingcopy-121270\repo\glasgow-haskell-compiler\inplace\mingw\bin\ar.exe: creating libraries/mtl/dist-install/build/libHSmtl-2.2.2.a
582C:\msys64\var\drydock\workingcopy-121270\repo\glasgow-haskell-compiler\inplace\mingw\bin\ar.exe: creating libraries/pretty/dist-install/build/libHSpretty-1.1.3.6.a
583C:\msys64\var\drydock\workingcopy-121270\repo\glasgow-haskell-compiler\inplace\mingw\bin\ar.exe: creating libraries/xhtml/dist-install/build/libHSxhtml-3000.2.2.a
584C:\msys64\var\drydock\workingcopy-121270\repo\glasgow-haskell-compiler\inplace\mingw\bin\ar.exe: creating libraries/stm/dist-install/build/libHSstm-2.4.5.0.a
585C:\msys64\var\drydock\workingcopy-121270\repo\glasgow-haskell-compiler\inplace\mingw\bin\ar.exe: creating libraries/Win32/dist-install/build/libHSWin32-2.6.1.0.a
586C:\msys64\var\drydock\workingcopy-121270\repo\glasgow-haskell-compiler\inplace\mingw\bin\ar.exe: creating libraries/array/dist-install/build/libHSarray-0.5.2.0.a
587C:\msys64\var\drydock\workingcopy-121270\repo\glasgow-haskell-compiler\inplace\mingw\bin\ar.exe: creating libraries/ghc-compact/dist-install/build/libHSghc-compact-0.1.0.0.a
588C:\msys64\var\drydock\workingcopy-121270\repo\glasgow-haskell-compiler\inplace\mingw\bin\ar.exe: creating libraries/template-haskell/dist-install/build/libHStemplate-haskell-2.13.0.0.a
589C:\msys64\var\drydock\workingcopy-121270\repo\glasgow-haskell-compiler\inplace\mingw\bin\ar.exe: creating libraries/bytestring/dist-install/build/libHSbytestring-0.10.8.2.a
590C:\msys64\var\drydock\workingcopy-121270\repo\glasgow-haskell-compiler\inplace\mingw\bin\ar.exe: creating libraries/containers/dist-install/build/libHScontainers-0.5.11.0.a
591C:\msys64\var\drydock\workingcopy-121270\repo\glasgow-haskell-compiler\inplace\mingw\bin\ar.exe: creating libraries/time/dist-install/build/libHStime-1.8.0.2.a
592C:\msys64\var\drydock\workingcopy-121270\repo\glasgow-haskell-compiler\inplace\mingw\bin\ar.exe: creating libraries/hpc/dist-install/build/libHShpc-0.6.0.3.a
593WARNING: file compiler\simplCore\SimplCore.hs, line 706
594 Simplifier bailing out after 4 iterations [705, 14, 1, 4]
595 Size = {terms: 1,969, types: 2,087, coercions: 8, joins: 2/14}
596C:\msys64\var\drydock\workingcopy-121270\repo\glasgow-haskell-compiler\inplace\mingw\bin\ar.exe: creating libraries/directory/dist-install/build/libHSdirectory-1.3.1.5.a
597C:\msys64\var\drydock\workingcopy-121270\repo\glasgow-haskell-compiler\inplace\mingw\bin\ar.exe: creating libraries/process/dist-install/build/libHSprocess-1.6.3.0.a
598WARNING: file compiler\simplCore\SimplCore.hs, line 706
599 Simplifier bailing out after 4 iterations [57, 2, 1, 1]
600 Size = {terms: 687, types: 903, coercions: 12, joins: 0/27}
601C:\msys64\var\drydock\workingcopy-121270\repo\glasgow-haskell-compiler\inplace\mingw\bin\ar.exe: creating libraries/binary/dist-install/build/libHSbinary-0.8.5.1.a
602C:\msys64\var\drydock\workingcopy-121270\repo\glasgow-haskell-compiler\inplace\mingw\bin\ar.exe: creating libraries/ghc-boot/dist-install/build/libHSghc-boot-8.5.a
603C:\msys64\var\drydock\workingcopy-121270\repo\glasgow-haskell-compiler\inplace\mingw\bin\ar.exe: creating libraries/haskeline/dist-install/build/libHShaskeline-0.7.4.2.a
604C:\msys64\var\drydock\workingcopy-121270\repo\glasgow-haskell-compiler\inplace\mingw\bin\ar.exe: creating libraries/parsec/dist-install/build/libHSparsec-3.1.13.0.a
605C:\msys64\var\drydock\workingcopy-121270\repo\glasgow-haskell-compiler\inplace\mingw\bin\ar.exe: creating libraries/text/dist-install/build/libHStext-1.2.3.0.a
606C:\msys64\var\drydock\workingcopy-121270\repo\glasgow-haskell-compiler\inplace\mingw\bin\ar.exe: creating libraries/ghci/dist-install/build/libHSghci-8.5.a
607
608compiler\ghci\RtClosureInspect.hs:191:47: error: [-Wunused-matches, -Werror=unused-matches]
609 Defined but not used: ‘t’
610 |
611191 | itbl@(InfoTable.StgInfoTable _ _ _ t _ _) <- peekItbl iptr1
612 | ^
613
614compiler\ghci\RtClosureInspect.hs:1313:1: error: [-Wunused-top-binds, -Werror=unused-top-binds]
615 Defined but not used: ‘amap'’
616 |
6171313 | amap' f (Array i0 i _ arr#) = map g [0 .. i - i0]
618 | ^^^^^
619make[1]: *** [compiler/ghc.mk:447: compiler/stage2/build/RtClosureInspect.o] Error 1
620make[1]: *** Waiting for unfinished jobs....
621make: *** [Makefile:127: all] Error 2
622

Build Log 257094 (remote - stdout)
25 - 50 - 100 - Unlimited Lines

6175 HC [stage 1] libraries/Cabal/Cabal/dist-install/build/Distribution/Simple/Program/Strip.o
6176 HC [stage 1] compiler/stage2/build/TcRnMonad.o
6177 HC [stage 1] compiler/stage2/build/PrelInfo.o
6178 HC [stage 1] compiler/stage2/build/GHCi.o
6179 HC [stage 1] compiler/stage2/build/ToIface.o
6180 HC [stage 1] compiler/stage2/build/UnariseStg.o
6181 HC [stage 1] compiler/stage2/build/CoreToStg.o
6182 HC [stage 1] compiler/stage2/build/WwLib.o
6183 HC [stage 1] libraries/Cabal/Cabal/dist-install/build/Distribution/Types/Component.o
6184 HC [stage 1] libraries/Cabal/Cabal/dist-install/build/Distribution/Types/ForeignLib/Lens.o
6185 HC [stage 1] compiler/stage2/build/ByteCodeItbls.o
6186 HC [stage 1] compiler/stage2/build/ByteCodeLink.o
6187 HC [stage 1] compiler/stage2/build/StgCmmCon.o
6188 HC [stage 1] compiler/stage2/build/SimplStg.o
6189 HC [stage 1] compiler/stage2/build/WorkWrap.o
6190 HC [stage 1] compiler/stage2/build/DmdAnal.o
6191 HC [stage 1] compiler/stage2/build/Coverage.o
6192 HC [stage 1] libraries/Cabal/Cabal/dist-install/build/Distribution/Types/ComponentRequestedSpec.o
6193 HC [stage 1] libraries/Cabal/Cabal/dist-install/build/Distribution/InstalledPackageInfo.o
6194 HC [stage 1] compiler/stage2/build/LoadIface.o-boot
6195 HC [stage 1] compiler/stage2/build/IfaceEnv.o
6196 HC [stage 1] compiler/stage2/build/TcMType.o
6197 HC [stage 1] compiler/stage2/build/RnUnbound.o
6198 HC [stage 1] compiler/stage2/build/ByteCodeAsm.o
6199 HC [stage 1] compiler/stage2/build/RnSplice.o-boot
6200 HC [stage 1] compiler/stage2/build/TcAnnotations.o
6201 HC [stage 1] compiler/stage2/build/TcPatSyn.o-boot
6202 HC [stage 1] compiler/stage2/build/StgCmmExpr.o
6203 HC [stage 1] libraries/Cabal/Cabal/dist-install/build/Distribution/Simple/PackageIndex.o
6204 HC [stage 1] libraries/Cabal/Cabal/dist-install/build/Distribution/Types/PackageDescription.o
6205 HC [stage 1] libraries/Cabal/Cabal/dist-install/build/Distribution/Backpack/ModuleShape.o
6206 HC [stage 1] libraries/Cabal/Cabal/dist-install/build/Distribution/Simple/Program/HcPkg.o
6207 HC [stage 1] libraries/Cabal/Cabal/dist-install/build/Distribution/Simple/GHC/IPI642.o
6208 HC [stage 1] compiler/stage2/build/NameShape.o
6209 HC [stage 1] compiler/stage2/build/BinIface.o
6210 HC [stage 1] compiler/stage2/build/TcHsSyn.o
6211 HC [stage 1] compiler/stage2/build/BuildTyCl.o
6212 HC [stage 1] compiler/stage2/build/StgCmmBind.o
6213 HC [stage 1] compiler/stage2/build/ByteCodeGen.o
6214 HC [stage 1] compiler/stage2/build/DebuggerUtils.o
6215 HC [stage 1] libraries/Cabal/Cabal/dist-install/build/Distribution/Backpack/PreModuleShape.o
6216 HC [stage 1] libraries/Cabal/Cabal/dist-install/build/Distribution/Backpack/PreExistingComponent.o
6217 HC [stage 1] utils/ghc-pkg/dist-install/build/Main.o
6218 HC [stage 1] compiler/stage2/build/RnModIface.o
6219 HC [stage 1] compiler/stage2/build/FlagChecker.o
6220 HC [stage 1] compiler/stage2/build/CmmParse.o
6221 HC [stage 1] compiler/stage2/build/StgCmm.o
6222 HC [stage 1] compiler/stage2/build/LoadIface.o
6223 HC [stage 1] compiler/stage2/build/TmOracle.o
6224 HC [stage 1] libraries/Cabal/Cabal/dist-install/build/Distribution/Types/GenericPackageDescription.o
6225 HC [stage 1] libraries/Cabal/Cabal/dist-install/build/Distribution/Types/PackageDescription/Lens.o
6226 HC [stage 1] compiler/stage2/build/TcEnv.o
6227 HC [stage 1] compiler/stage2/build/RnFixity.o
6228 HC [stage 1] compiler/stage2/build/Linker.o
6229 HC [stage 1] compiler/stage2/build/MkIface.o
6230 HC [stage 1] compiler/stage2/build/FamInst.o
6231 HC [stage 1] compiler/stage2/build/CoreMonad.o
6232 HC [stage 1] compiler/stage2/build/RnUtils.o
6233 HC [stage 1] compiler/stage2/build/StaticPtrTable.o
6234 HC [stage 1] libraries/Cabal/Cabal/dist-install/build/Distribution/PackageDescription.o
6235 HC [stage 1] libraries/Cabal/Cabal/dist-install/build/Distribution/Types/GenericPackageDescription/Lens.o
6236 HC [stage 1] libraries/Cabal/Cabal/dist-install/build/Distribution/Parsec/ConfVar.o
6237 HC [stage 1] compiler/stage2/build/RnEnv.o
6238 HC [stage 1] compiler/stage2/build/FunDeps.o
6239 HC [stage 1] libraries/Cabal/Cabal/dist-install/build/Distribution/Types/ComponentLocalBuildInfo.o
6240 HC [stage 1] libraries/Cabal/Cabal/dist-install/build/Distribution/Simple/Setup.o
6241 HC [stage 1] libraries/Cabal/Cabal/dist-install/build/Distribution/Simple/BuildToolDepends.o
6242 HC [stage 1] libraries/Cabal/Cabal/dist-install/build/Distribution/Backpack/UnifyM.o
6243 HC [stage 1] libraries/Cabal/Cabal/dist-install/build/Distribution/PackageDescription/Configuration.o
6244 HC [stage 1] libraries/Cabal/Cabal/dist-install/build/Distribution/Types/Lens.o
6245 HC [stage 1] compiler/stage2/build/Plugins.o
6246 HC [stage 1] compiler/stage2/build/RnNames.o
6247 HC [stage 1] compiler/stage2/build/PprTyThing.o
6248 HC [stage 1] compiler/stage2/build/Inst.o
6249 HC [stage 1] compiler/stage2/build/RnTypes.o
6250 HC [stage 1] compiler/stage2/build/CoreLint.o
6251 HC [stage 1] compiler/stage2/build/SpecConstr.o
6252 HC [stage 1] compiler/stage2/build/Specialise.o
6253 HC [stage 1] compiler/stage2/build/SetLevels.o
6254 HC [stage 1] compiler/stage2/build/FloatIn.o
6255 HC [stage 1] compiler/stage2/build/SimplMonad.o
6256 HC [stage 1] libraries/Cabal/Cabal/dist-install/build/Distribution/Types/TargetInfo.o
6257 HC [stage 1] libraries/Cabal/Cabal/dist-install/build/Distribution/Backpack/MixLink.o
6258 HC [stage 1] libraries/Cabal/Cabal/dist-install/build/Distribution/PackageDescription/FieldGrammar.o
6259 HC [stage 1] compiler/stage2/build/DynamicLoading.o
6260 HC [stage 1] compiler/stage2/build/RnPat.o
6261 HC [stage 1] compiler/stage2/build/TcUnify.o
6262 HC [stage 1] compiler/stage2/build/TcIface.o
6263 HC [stage 1] compiler/stage2/build/TcRnExports.o
6264 HC [stage 1] compiler/stage2/build/CorePrep.o
6265 HC [stage 1] compiler/stage2/build/FloatOut.o
6266 HC [stage 1] compiler/stage2/build/SimplEnv.o
6267 HC [stage 1] compiler/stage2/build/GhcPlugins.o
6268 HC [stage 1] compiler/stage2/build/RnBinds.o
6269 HC [stage 1] compiler/stage2/build/TcErrors.o
6270 HC [stage 1] compiler/stage2/build/DsMonad.o
6271 HC [stage 1] compiler/stage2/build/TidyPgm.o
6272 HC [stage 1] compiler/stage2/build/SimplUtils.o
6273 HC [stage 1] compiler/stage2/build/RtClosureInspect.o
6274

Drydock: Prepare tree

When
Completed at Mar 27 2018, 8:10 AM · Built for 59 s
Status
Passed

Build Log 257093 (remote - stderr)
25 - 50 - 100 - Unlimited Lines

1+ git clean -qxfd
2+ git submodule foreach git checkout .
3+ git submodule foreach git clean -qxfd
4+ git submodule sync
5+ git submodule update --init --recursive
6+ git submodule foreach -q git clean -qxfd
7

Build Log 257092 (remote - stdout)
25 - 50 - 100 - Unlimited Lines

3Entering 'libraries/Cabal'
4Entering 'libraries/Win32'
5Entering 'libraries/array'
6Entering 'libraries/binary'
7Entering 'libraries/bytestring'
8Entering 'libraries/containers'
9Entering 'libraries/deepseq'
10Entering 'libraries/directory'
11Entering 'libraries/dph'
12Entering 'libraries/filepath'
13Entering 'libraries/haskeline'
14Entering 'libraries/hpc'
15Entering 'libraries/integer-gmp/gmp/gmp-tarballs'
16Entering 'libraries/mtl'
17Entering 'libraries/parallel'
18Entering 'libraries/parsec'
19Entering 'libraries/pretty'
20Entering 'libraries/primitive'
21Entering 'libraries/process'
22Entering 'libraries/random'
23Entering 'libraries/stm'
24Entering 'libraries/terminfo'
25Entering 'libraries/text'
26Entering 'libraries/time'
27Entering 'libraries/transformers'
28Entering 'libraries/unix'
29Entering 'libraries/vector'
30Entering 'libraries/xhtml'
31Entering 'nofib'
32Entering 'utils/haddock'
33Entering 'utils/hsc2hs'
34Entering '.arc-linters/arcanist-external-json-linter'
35Entering 'hadrian'
36Entering 'libffi-tarballs'
37Entering 'libraries/Cabal'
38Entering 'libraries/Win32'
39Entering 'libraries/array'
40Entering 'libraries/binary'
41Entering 'libraries/bytestring'
42Entering 'libraries/containers'
43Entering 'libraries/deepseq'
44Entering 'libraries/directory'
45Entering 'libraries/dph'
46Entering 'libraries/filepath'
47Entering 'libraries/haskeline'
48Entering 'libraries/hpc'
49Entering 'libraries/integer-gmp/gmp/gmp-tarballs'
50Entering 'libraries/mtl'
51Entering 'libraries/parallel'
52Entering 'libraries/parsec'
53Entering 'libraries/pretty'
54Entering 'libraries/primitive'
55Entering 'libraries/process'
56Entering 'libraries/random'
57Entering 'libraries/stm'
58Entering 'libraries/terminfo'
59Entering 'libraries/text'
60Entering 'libraries/time'
61Entering 'libraries/transformers'
62Entering 'libraries/unix'
63Entering 'libraries/vector'
64Entering 'libraries/xhtml'
65Entering 'nofib'
66Entering 'utils/haddock'
67Entering 'utils/hsc2hs'
68Synchronizing submodule url for '.arc-linters/arcanist-external-json-linter'
69Synchronizing submodule url for 'hadrian'
70Synchronizing submodule url for 'libffi-tarballs'
71Synchronizing submodule url for 'libraries/Cabal'
72Synchronizing submodule url for 'libraries/Win32'
73Synchronizing submodule url for 'libraries/array'
74Synchronizing submodule url for 'libraries/binary'
75Synchronizing submodule url for 'libraries/bytestring'
76Synchronizing submodule url for 'libraries/containers'
77Synchronizing submodule url for 'libraries/deepseq'
78Synchronizing submodule url for 'libraries/directory'
79Synchronizing submodule url for 'libraries/dph'
80Synchronizing submodule url for 'libraries/filepath'
81Synchronizing submodule url for 'libraries/haskeline'
82Synchronizing submodule url for 'libraries/hpc'
83Synchronizing submodule url for 'libraries/integer-gmp/gmp/gmp-tarballs'
84Synchronizing submodule url for 'libraries/mtl'
85Synchronizing submodule url for 'libraries/parallel'
86Synchronizing submodule url for 'libraries/parsec'
87Synchronizing submodule url for 'libraries/pretty'
88Synchronizing submodule url for 'libraries/primitive'
89Synchronizing submodule url for 'libraries/process'
90Synchronizing submodule url for 'libraries/random'
91Synchronizing submodule url for 'libraries/stm'
92Synchronizing submodule url for 'libraries/terminfo'
93Synchronizing submodule url for 'libraries/text'
94Synchronizing submodule url for 'libraries/time'
95Synchronizing submodule url for 'libraries/transformers'
96Synchronizing submodule url for 'libraries/unix'
97Synchronizing submodule url for 'libraries/vector'
98Synchronizing submodule url for 'libraries/xhtml'
99Synchronizing submodule url for 'nofib'
100Synchronizing submodule url for 'utils/haddock'
101Synchronizing submodule url for 'utils/hsc2hs'
102

Lease Working Copy

When
Completed at Mar 27 2018, 8:09 AM · Built instantly
Status
Passed