Build 42715

Properties

Drydock: Build

When
Completed at Mar 15 2018, 8:40 AM · Built for 1 h, 9 m
Status
Failed

Build Log 254705 (remote - stderr)
25 - 50 - 100 - Unlimited Lines

680C:\msys64\var\drydock\workingcopy-121270\repo\glasgow-haskell-compiler\inplace\mingw\bin\ar.exe: creating compiler/stage2/build/libHSghc-8.5.a
681Warning: -rtsopts and -with-rtsopts have no effect with -no-hs-main.
682 Call hs_init_ghc() from your main() function to set these options.
683C:\msys64\var\drydock\workingcopy-121270\repo\glasgow-haskell-compiler\inplace\mingw\bin\ar.exe: creating libraries/parallel/dist-install/build/libHSparallel-3.2.1.1.a
684C:\msys64\var\drydock\workingcopy-121270\repo\glasgow-haskell-compiler\inplace\mingw\bin\ar.exe: creating libraries/random/dist-install/build/libHSrandom-1.1.a
685Warning: include-dirs: C:\msys64\var\drydock\workingcopy-121270\repo\glasgow-haskell-compiler\compiler\stage2\build\utils doesn't exist or isn't a directory
686Warning: include-dirs: C:\msys64\var\drydock\workingcopy-121270\repo\glasgow-haskell-compiler\compiler\stage2\build\../rts/dist/build doesn't exist or isn't a directory
687Warning: include-dirs: C:\msys64\var\drydock\workingcopy-121270\repo\glasgow-haskell-compiler\compiler\stage2\build\stage2 doesn't exist or isn't a directory
688Warning: include-dirs: C:\msys64\var\drydock\workingcopy-121270\repo\glasgow-haskell-compiler\libraries\haskeline\dist-install\build\includes doesn't exist or isn't a directory
689Warning: include-dirs: C:\msys64\var\drydock\workingcopy-121270\repo\glasgow-haskell-compiler\libraries\text\dist-install\build\include doesn't exist or isn't a directory
690Warning: include-dirs: C:\msys64\var\drydock\workingcopy-121270\repo\glasgow-haskell-compiler\libraries\Win32\dist-install\build\include doesn't exist or isn't a directory
691Warning: include-dirs: C:\msys64\var\drydock\workingcopy-121270\repo\glasgow-haskell-compiler\libraries\containers\dist-install\build\include doesn't exist or isn't a directory
692Warning: include-dirs: C:\msys64\var\drydock\workingcopy-121270\repo\glasgow-haskell-compiler\libraries\bytestring\dist-install\build\include doesn't exist or isn't a directory
693rts-1.0: Warning: .:479:1: The field "hugs-options" is deprecated. hugs isn't supported anymore
694Warning: cannot determine version of
695C:/msys64/var/drydock/workingcopy-121270/repo/glasgow-haskell-compiler/bindistprep/ghc-8.5.20180315/bin/ghc-pkg.exe
696:
697""
698libraries\Cabal\Cabal\Distribution\Simple\GHC.hs:1784:5-47: Irrefutable pattern failed for pattern Just ver
699
700make[3]: *** [ghc.mk:1003: install_packages] Error 1
701make[2]: *** [Makefile:127: install] Error 2
702make[1]: *** [ghc.mk:1126: windows-binary-dist-prep] Error 2
703make: *** [Makefile:145: binary-dist-prep] Error 2
704

Build Log 254704 (remote - stdout)
25 - 50 - 100 - Unlimited Lines

6984Installing library in C:/msys64/var/drydock/workingcopy-121270/repo/glasgow-haskell-compiler/bindistprep/ghc-8.5.20180315/lib\random-1.1
6985Reading package info from "rts/dist/package.conf.install" ... done.
6986Registering library for ghc-prim-0.5.2.0..
6987Registering library for integer-gmp-1.0.1.0..
6988Registering library for base-4.11.0.0..
6989Registering library for filepath-1.4.2..
6990Registering library for array-0.5.2.0..
6991Registering library for deepseq-1.4.3.0..
6992Registering library for bytestring-0.10.8.2..
6993Registering library for containers-0.5.11.0..
6994Registering library for Win32-2.6.1.0..
6995Registering library for time-1.8.0.2..
6996Registering library for directory-1.3.1.5..
6997Registering library for process-1.6.3.0..
6998Registering library for hpc-0.6.0.3..
6999Registering library for pretty-1.1.3.6..
7000Registering library for binary-0.8.5.1..
7001Registering library for text-1.2.3.0..
7002Registering library for transformers-0.5.5.0..
7003Registering library for mtl-2.2.2..
7004Registering library for parsec-3.1.13.0..
7005Registering library for Cabal-2.3.0.0..
7006Registering library for ghc-boot-th-8.5..
7007Registering library for ghc-boot-8.5..
7008

Drydock: Prepare tree

When
Completed at Mar 15 2018, 7:30 AM · Built for 1 m, 55 s
Status
Passed

Build Log 254703 (remote - stderr)
25 - 50 - 100 - Unlimited Lines

1+ git clean -qxfd
2+ git submodule foreach git checkout .
3+ git submodule foreach git clean -qxfd
4+ git submodule sync
5+ git submodule update --init --recursive
6+ git submodule foreach -q git clean -qxfd
7

Build Log 254702 (remote - stdout)
25 - 50 - 100 - Unlimited Lines

79Synchronizing submodule url for 'libraries/dph'
80Synchronizing submodule url for 'libraries/filepath'
81Synchronizing submodule url for 'libraries/haskeline'
82Synchronizing submodule url for 'libraries/hpc'
83Synchronizing submodule url for 'libraries/integer-gmp/gmp/gmp-tarballs'
84Synchronizing submodule url for 'libraries/mtl'
85Synchronizing submodule url for 'libraries/parallel'
86Synchronizing submodule url for 'libraries/parsec'
87Synchronizing submodule url for 'libraries/pretty'
88Synchronizing submodule url for 'libraries/primitive'
89Synchronizing submodule url for 'libraries/process'
90Synchronizing submodule url for 'libraries/random'
91Synchronizing submodule url for 'libraries/stm'
92Synchronizing submodule url for 'libraries/terminfo'
93Synchronizing submodule url for 'libraries/text'
94Synchronizing submodule url for 'libraries/time'
95Synchronizing submodule url for 'libraries/transformers'
96Synchronizing submodule url for 'libraries/unix'
97Synchronizing submodule url for 'libraries/vector'
98Synchronizing submodule url for 'libraries/xhtml'
99Synchronizing submodule url for 'nofib'
100Synchronizing submodule url for 'utils/haddock'
101Synchronizing submodule url for 'utils/hsc2hs'
102Submodule path 'libraries/Cabal': checked out 'c219cd3f31c8e4e4bc71f93bbcd4de87830a986d'
103

Lease Working Copy

When
Completed at Mar 15 2018, 7:28 AM · Built instantly
Status
Passed