Build 41207

Properties

Drydock: Build

When
Completed at Feb 11 2018, 2:23 PM · Built for 1 h, 17 m
Status
Failed

Build Log 247989 (remote - stderr)
25 - 50 - 100 - Unlimited Lines

456Declaration for mkTrApp
457Unfolding of mkTrApp:
458 Failed to load interface for ‘GHC.Fingerprint’
459 There are files missing in the ‘base-4.11.0.0’ package,
460 try running 'ghc-pkg check'.
461 Use -v to see a list of the files searched for.
462
463compiler/codeGen/StgCmmUtils.hs:78:1: error: [-Wunused-imports, -Werror=unused-imports]
464 The import of ‘Data.List’ is redundant
465 except perhaps to import instances from ‘Data.List’
466 To import instances alone, use: import Data.List()
467 |
46878 | import Data.List
469 | ^^^^^^^^^^^^^^^^
470
471compiler/codeGen/StgCmmUtils.hs:79:1: error: [-Wunused-imports, -Werror=unused-imports]
472 The import of ‘Data.Ord’ is redundant
473 except perhaps to import instances from ‘Data.Ord’
474 To import instances alone, use: import Data.Ord()
475 |
47679 | import Data.Ord
477 | ^^^^^^^^^^^^^^^
478make[1]: *** [compiler/stage2/build/StgCmmUtils.o] Error 1
479make: *** [all] Error 2
480

Build Log 247988 (remote - stdout)
25 - 50 - 100 - Unlimited Lines

4117 HC [stage 1] compiler/stage2/build/Llvm/AbsSyn.o
4118 HC [stage 1] compiler/stage2/build/Llvm/PpLlvm.o
4119 HC [stage 1] compiler/stage2/build/Llvm.o
4120 HC [stage 1] compiler/stage2/build/LlvmCodeGen/Regs.o
4121 HC [stage 1] compiler/stage2/build/LlvmCodeGen/Base.o
4122 HC [stage 1] compiler/stage2/build/SysTools/Tasks.o
4123 HC [stage 1] libraries/bytestring/dist-install/build/Data/ByteString/Lazy/Char8.o
4124 HC [stage 1] compiler/stage2/build/Elf.o
4125 HC [stage 1] compiler/stage2/build/SysTools/ExtraObj.o
4126 HC [stage 1] compiler/stage2/build/SysTools.o
4127 HC [stage 1] compiler/stage2/build/StgSyn.o
4128 HC [stage 1] compiler/stage2/build/Bitmap.o
4129 HC [stage 1] compiler/stage2/build/CmmUtils.o
4130 HC [stage 1] compiler/stage2/build/CmmInfo.o
4131 HC [stage 1] compiler/stage2/build/PprCmmExpr.o
4132 HC [stage 1] compiler/stage2/build/PprCmmDecl.o
4133 HC [stage 1] compiler/stage2/build/PprCmm.o
4134 HC [stage 1] compiler/stage2/build/CmmCallConv.o
4135 HC [stage 1] compiler/stage2/build/MkGraph.o
4136 HC [stage 1] compiler/stage2/build/StgCmmClosure.o
4137 HC [stage 1] compiler/stage2/build/StgCmmMonad.o
4138 HC [stage 1] compiler/stage2/build/StgCmmUtils.o
4139compiler/ghc.mk:447: recipe for target 'compiler/stage2/build/StgCmmUtils.o' failed
4140Makefile:122: recipe for target 'all' failed
4141

Drydock: Prepare tree

When
Completed at Feb 11 2018, 1:06 PM · Built for 3 s
Status
Passed

Build Log 247987 (remote - stderr)
25 - 50 - 100 - Unlimited Lines

1+ git clean -qxfd
2+ git submodule sync
3+ git submodule update --init --recursive
4+ git submodule foreach -q git clean -qxfd
5

Build Log 247986 (remote - stdout)
25 - 50 - 100 - Unlimited Lines

10Synchronizing submodule url for 'libraries/directory'
11Synchronizing submodule url for 'libraries/dph'
12Synchronizing submodule url for 'libraries/filepath'
13Synchronizing submodule url for 'libraries/haskeline'
14Synchronizing submodule url for 'libraries/hpc'
15Synchronizing submodule url for 'libraries/integer-gmp/gmp/gmp-tarballs'
16Synchronizing submodule url for 'libraries/mtl'
17Synchronizing submodule url for 'libraries/parallel'
18Synchronizing submodule url for 'libraries/parsec'
19Synchronizing submodule url for 'libraries/pretty'
20Synchronizing submodule url for 'libraries/primitive'
21Synchronizing submodule url for 'libraries/process'
22Synchronizing submodule url for 'libraries/random'
23Synchronizing submodule url for 'libraries/stm'
24Synchronizing submodule url for 'libraries/terminfo'
25Synchronizing submodule url for 'libraries/text'
26Synchronizing submodule url for 'libraries/time'
27Synchronizing submodule url for 'libraries/transformers'
28Synchronizing submodule url for 'libraries/unix'
29Synchronizing submodule url for 'libraries/vector'
30Synchronizing submodule url for 'libraries/xhtml'
31Synchronizing submodule url for 'nofib'
32Synchronizing submodule url for 'utils/haddock'
33Synchronizing submodule url for 'utils/hsc2hs'
34

Build Working Copy

When
Completed at Feb 11 2018, 1:06 PM · Built instantly
Status
Passed
Description

Lease a working copy for Linux/amd64 builds.