Build 41206

Properties

Drydock: Build

When
Completed at Feb 11 2018, 5:23 AM · Built for 48 m, 8 s
Status
Failed
Description

Run the build.

Build Log 247951 (remote - stderr)
25 - 50 - 100 - Unlimited Lines

677 Call hs_init_ghc() from your main() function to set these options.
678Warning: -rtsopts and -with-rtsopts have no effect with -shared.
679 Call hs_init_ghc() from your main() function to set these options.
680Warning: -rtsopts and -with-rtsopts have no effect with -shared.
681 Call hs_init_ghc() from your main() function to set these options.
682
683compiler/codeGen/StgCmmUtils.hs:78:1: error: [-Wunused-imports, -Werror=unused-imports]
684 The import of ‘Data.List’ is redundant
685 except perhaps to import instances from ‘Data.List’
686 To import instances alone, use: import Data.List()
687 |
68878 | import Data.List
689 | ^^^^^^^^^^^^^^^^
690
691compiler/codeGen/StgCmmUtils.hs:79:1: error: [-Wunused-imports, -Werror=unused-imports]
692 The import of ‘Data.Ord’ is redundant
693 except perhaps to import instances from ‘Data.Ord’
694 To import instances alone, use: import Data.Ord()
695 |
69679 | import Data.Ord
697 | ^^^^^^^^^^^^^^^
698make[1]: *** [compiler/stage2/build/StgCmmUtils.o] Error 1
699make[1]: *** Waiting for unfinished jobs....
700make: *** [all] Error 2
701

Build Log 247950 (remote - stdout)
25 - 50 - 100 - Unlimited Lines

4858 HC [stage 1] compiler/stage2/build/RegAlloc/Linear/Base.o
4859 HC [stage 1] compiler/stage2/build/RegAlloc/Graph/Coalesce.o
4860 HC [stage 1] libraries/Cabal/Cabal/dist-install/build/Distribution/Simple/PackageIndex.o
4861 HC [stage 1] libraries/Cabal/Cabal/dist-install/build/Distribution/Types/PackageDescription.o
4862 HC [stage 1] libraries/Cabal/Cabal/dist-install/build/Distribution/Backpack/ModuleShape.o
4863 HC [stage 1] libraries/Cabal/Cabal/dist-install/build/Distribution/Simple/Program/HcPkg.o
4864 HC [stage 1] libraries/Cabal/Cabal/dist-install/build/Distribution/Simple/GHC/IPI642.o
4865 HC [stage 1] compiler/stage2/build/Llvm/PpLlvm.o
4866 HC [stage 1] compiler/stage2/build/StgCmmMonad.o
4867 HC [stage 1] compiler/stage2/build/Dwarf.o
4868 HC [stage 1] compiler/stage2/build/PIC.o
4869 HC [stage 1] compiler/stage2/build/RegAlloc/Graph/Stats.o
4870 HC [stage 1] compiler/stage2/build/RegAlloc/Linear/FreeRegs.o
4871 HC [stage 1] compiler/stage2/build/RegAlloc/Linear/Stats.o
4872 HC [stage 1] compiler/stage2/build/PPC/Ppr.o
4873 HC [stage 1] compiler/stage2/build/PPC/RegInfo.o
4874 HC [stage 1] compiler/stage2/build/SPARC/Ppr.o
4875 HC [stage 1] compiler/stage2/build/SPARC/ShortcutJump.o
4876 HC [stage 1] compiler/stage2/build/SPARC/CodeGen/Base.o
4877 HC [stage 1] compiler/stage2/build/X86/Ppr.o
4878 HC [stage 1] libraries/Cabal/Cabal/dist-install/build/Distribution/Backpack/PreModuleShape.o
4879 HC [stage 1] libraries/Cabal/Cabal/dist-install/build/Distribution/Backpack/PreExistingComponent.o
4880 HC [stage 1] compiler/stage2/build/Llvm.o
4881 HC [stage 1] compiler/stage2/build/StgCmmUtils.o
4882

Drydock: Prepare tree

When
Completed at Feb 11 2018, 4:35 AM · Built for 10 s
Status
Passed

Build Log 247949 (remote - stderr)
25 - 50 - 100 - Unlimited Lines

1+ git clean -qxfd
2+ git submodule sync
3+ git submodule update --init --recursive
4+ git submodule foreach -q git clean -qxfd
5

Build Log 247948 (remote - stdout)
25 - 50 - 100 - Unlimited Lines

12Synchronizing submodule url for 'libraries/filepath'
13Synchronizing submodule url for 'libraries/haskeline'
14Synchronizing submodule url for 'libraries/hpc'
15Synchronizing submodule url for 'libraries/integer-gmp/gmp/gmp-tarballs'
16Synchronizing submodule url for 'libraries/mtl'
17Synchronizing submodule url for 'libraries/parallel'
18Synchronizing submodule url for 'libraries/parsec'
19Synchronizing submodule url for 'libraries/pretty'
20Synchronizing submodule url for 'libraries/primitive'
21Synchronizing submodule url for 'libraries/process'
22Synchronizing submodule url for 'libraries/random'
23Synchronizing submodule url for 'libraries/stm'
24Synchronizing submodule url for 'libraries/terminfo'
25Synchronizing submodule url for 'libraries/text'
26Synchronizing submodule url for 'libraries/time'
27Synchronizing submodule url for 'libraries/transformers'
28Synchronizing submodule url for 'libraries/unix'
29Synchronizing submodule url for 'libraries/vector'
30Synchronizing submodule url for 'libraries/xhtml'
31Synchronizing submodule url for 'nofib'
32Synchronizing submodule url for 'utils/haddock'
33Synchronizing submodule url for 'utils/hsc2hs'
34Submodule path 'libraries/Cabal': checked out '578d3a50db818223017b8891df268d4200b8ffd3'
35Submodule path 'libraries/containers': checked out 'a57e7dd0c0aa6a719a73085ae30edef8206ccea0'
36

Lease Working Copy

When
Completed at Feb 11 2018, 4:35 AM · Built instantly
Status
Passed
Description

Lease a working copy for OSX/amd64 builds.