Build 41205

Properties

Drydock: Build

When
Completed at Feb 11 2018, 6:06 AM · Built for 44 m, 27 s
Status
Failed

Build Log 247961 (remote - stderr)
25 - 50 - 100 - Unlimited Lines

599C:\msys64\var\drydock\workingcopy-121268\repo\glasgow-haskell-compiler\inplace\mingw\bin\ar.exe: creating libraries/ghc-boot/dist-install/build/libHSghc-boot-8.5.a
600C:\msys64\var\drydock\workingcopy-121268\repo\glasgow-haskell-compiler\inplace\mingw\bin\ar.exe: creating libraries/haskeline/dist-install/build/libHShaskeline-0.7.4.0.a
601C:\msys64\var\drydock\workingcopy-121268\repo\glasgow-haskell-compiler\inplace\mingw\bin\ar.exe: creating libraries/parsec/dist-install/build/libHSparsec-3.1.12.a
602C:\msys64\var\drydock\workingcopy-121268\repo\glasgow-haskell-compiler\inplace\mingw\bin\ar.exe: creating libraries/text/dist-install/build/libHStext-1.2.3.0.a
603C:\msys64\var\drydock\workingcopy-121268\repo\glasgow-haskell-compiler\inplace\mingw\bin\ar.exe: creating libraries/ghci/dist-install/build/libHSghci-8.5.a
604
605compiler\codeGen\StgCmmUtils.hs:78:1: error: [-Wunused-imports, -Werror=unused-imports]
606 The import of ‘Data.List’ is redundant
607 except perhaps to import instances from ‘Data.List’
608 To import instances alone, use: import Data.List()
609 |
61078 | import Data.List
611 | ^^^^^^^^^^^^^^^^
612
613compiler\codeGen\StgCmmUtils.hs:79:1: error: [-Wunused-imports, -Werror=unused-imports]
614 The import of ‘Data.Ord’ is redundant
615 except perhaps to import instances from ‘Data.Ord’
616 To import instances alone, use: import Data.Ord()
617 |
61879 | import Data.Ord
619 | ^^^^^^^^^^^^^^^
620make[1]: *** [compiler/ghc.mk:447: compiler/stage2/build/StgCmmUtils.o] Error 1
621make[1]: *** Waiting for unfinished jobs....
622make: *** [Makefile:127: all] Error 2
623

Build Log 247960 (remote - stdout)
25 - 50 - 100 - Unlimited Lines

6028 HC [stage 1] compiler/stage2/build/HsExpr.o
6029 HC [stage 1] compiler/stage2/build/Llvm/PpLlvm.o
6030 HC [stage 1] compiler/stage2/build/StgCmmMonad.o
6031 HC [stage 1] compiler/stage2/build/PIC.o
6032 HC [stage 1] compiler/stage2/build/RegAlloc/Graph/Stats.o
6033 HC [stage 1] compiler/stage2/build/RegAlloc/Linear/FreeRegs.o
6034 HC [stage 1] compiler/stage2/build/RegAlloc/Linear/Stats.o
6035 HC [stage 1] compiler/stage2/build/PPC/Ppr.o
6036 HC [stage 1] compiler/stage2/build/PPC/RegInfo.o
6037 HC [stage 1] compiler/stage2/build/SPARC/Ppr.o
6038 HC [stage 1] compiler/stage2/build/SPARC/ShortcutJump.o
6039 HC [stage 1] compiler/stage2/build/SPARC/CodeGen/Base.o
6040 HC [stage 1] compiler/stage2/build/X86/Ppr.o
6041 HC [stage 1] libraries/Cabal/Cabal/dist-install/build/Distribution/Backpack.o
6042 HC [stage 1] libraries/Cabal/Cabal/dist-install/build/Distribution/Package.o
6043 HC [stage 1] libraries/Cabal/Cabal/dist-install/build/Distribution/Types/BuildInfo.o
6044 HC [stage 1] libraries/Cabal/Cabal/dist-install/build/Distribution/FieldGrammar.o
6045 HC [stage 1] libraries/Cabal/Cabal/dist-install/build/Distribution/Simple/Program/Types.o
6046 HC [stage 1] libraries/Cabal/Cabal/dist-install/build/Distribution/Types/SetupBuildInfo/Lens.o
6047 HC [stage 1] libraries/Cabal/Cabal/dist-install/build/Distribution/Simple/GHC/ImplInfo.o
6048 HC [stage 1] compiler/stage2/build/Llvm.o
6049 HC [stage 1] compiler/stage2/build/StgCmmUtils.o
6050 HC [stage 1] compiler/stage2/build/RegAlloc/Graph/Main.o
6051 HC [stage 1] compiler/stage2/build/RegAlloc/Linear/State.o
6052

Drydock: Prepare tree

When
Completed at Feb 11 2018, 5:22 AM · Built for 38 s
Status
Passed

Build Log 247959 (remote - stderr)
25 - 50 - 100 - Unlimited Lines

1+ git clean -qxfd
2+ git submodule foreach git checkout .
3+ git submodule foreach git clean -qxfd
4+ git submodule sync
5+ git submodule update --init --recursive
6+ git submodule foreach -q git clean -qxfd
7

Build Log 247958 (remote - stdout)
25 - 50 - 100 - Unlimited Lines

78Synchronizing submodule url for 'libraries/directory'
79Synchronizing submodule url for 'libraries/dph'
80Synchronizing submodule url for 'libraries/filepath'
81Synchronizing submodule url for 'libraries/haskeline'
82Synchronizing submodule url for 'libraries/hpc'
83Synchronizing submodule url for 'libraries/integer-gmp/gmp/gmp-tarballs'
84Synchronizing submodule url for 'libraries/mtl'
85Synchronizing submodule url for 'libraries/parallel'
86Synchronizing submodule url for 'libraries/parsec'
87Synchronizing submodule url for 'libraries/pretty'
88Synchronizing submodule url for 'libraries/primitive'
89Synchronizing submodule url for 'libraries/process'
90Synchronizing submodule url for 'libraries/random'
91Synchronizing submodule url for 'libraries/stm'
92Synchronizing submodule url for 'libraries/terminfo'
93Synchronizing submodule url for 'libraries/text'
94Synchronizing submodule url for 'libraries/time'
95Synchronizing submodule url for 'libraries/transformers'
96Synchronizing submodule url for 'libraries/unix'
97Synchronizing submodule url for 'libraries/vector'
98Synchronizing submodule url for 'libraries/xhtml'
99Synchronizing submodule url for 'nofib'
100Synchronizing submodule url for 'utils/haddock'
101Synchronizing submodule url for 'utils/hsc2hs'
102

Lease Working Copy

When
Completed at Feb 11 2018, 5:21 AM · Built instantly
Status
Passed