Build 40406

Drydock: Build

When
Completed at Jan 26 2018, 10:45 PM · Built for 1 h, 10 m
Status
Failed

Build Log 244305 (remote - stderr)
25 - 50 - 100 - Unlimited Lines

2163Warning: -rtsopts and -with-rtsopts have no effect with -no-hs-main.
2164 Call hs_init_ghc() from your main() function to set these options.
2165ar: creating compiler/stage2/build/libHSghc-8.5.a
2166Warning: -rtsopts and -with-rtsopts have no effect with -shared.
2167 Call hs_init_ghc() from your main() function to set these options.
2168Warning: -rtsopts and -with-rtsopts have no effect with -no-hs-main.
2169 Call hs_init_ghc() from your main() function to set these options.
2170ar: creating libraries/parallel/dist-install/build/libHSparallel-3.2.1.1.a
2171ar: creating libraries/random/dist-install/build/libHSrandom-1.1.a
2172Warning: -rtsopts and -with-rtsopts have no effect with -shared.
2173 Call hs_init_ghc() from your main() function to set these options.
2174Warning: -rtsopts and -with-rtsopts have no effect with -shared.
2175 Call hs_init_ghc() from your main() function to set these options.
2176haddock: internal error: getMBlock: mmap: Invalid argument
2177 (GHC version 8.5.20180127 for i386_unknown_linux)
2178 Please report this as a GHC bug: http://www.haskell.org/ghc/reportabug
2179make[1]: *** [libraries/Cabal/Cabal/dist-install/doc/html/Cabal/Cabal.haddock] Aborted
2180make[1]: *** Deleting file 'libraries/Cabal/Cabal/dist-install/doc/html/Cabal/Cabal.haddock'
2181make[1]: *** Waiting for unfinished jobs....
2182haddock: internal error: getMBlock: mmap: Invalid argument
2183 (GHC version 8.5.20180127 for i386_unknown_linux)
2184 Please report this as a GHC bug: http://www.haskell.org/ghc/reportabug
2185make[1]: *** [compiler/stage2/doc/html/ghc/ghc.haddock] Aborted
2186make: *** [all] Error 2
2187

Build Log 244304 (remote - stdout)
25 - 50 - 100 - Unlimited Lines

5475 FD
5476Warning: GHC.PackageDb: could not find link destinations for:
5477 RepInstalledPackageInfo
5478Warning: Data.Text.Internal.Fusion.Common: could not find link destinations for:
5479 findIndicesI
5480Warning: Data.Text: could not find link destinations for:
5481 replicateChar countChar
5482Warning: Data.Text.Lazy: could not find link destinations for:
5483 replicateChar dropWords splitAtWord countChar
5484Warning: Data.Text.Internal.IO: could not find link destinations for:
5485 Handle__
5486Warning: Data.Text.Internal.Builder: could not find link destinations for:
5487 empty append
5488Warning: Data.Text.Lazy.Builder.RealFloat: could not find link destinations for:
5489 floatToDigits
5490Warning: GHCi.InfoTable: could not find link destinations for:
5491 EntryFunPtr HalfWord ItblCodes
5492Warning: Text.Parsec.Prim: could not find link destinations for:
5493 MonadTrans lift
5494Warning: Text.Parsec: could not find link destinations for:
5495 MonadTrans lift
5496libraries/Cabal/Cabal/ghc.mk:4: recipe for target 'libraries/Cabal/Cabal/dist-install/doc/html/Cabal/Cabal.haddock' failed
5497compiler/ghc.mk:447: recipe for target 'compiler/stage2/doc/html/ghc/ghc.haddock' failed
5498Makefile:122: recipe for target 'all' failed
5499

Drydock: Prepare tree

When
Completed at Jan 26 2018, 9:35 PM · Built for 3 s
Status
Passed

Build Log 244303 (remote - stderr)
25 - 50 - 100 - Unlimited Lines

1+ git clean -qxfd
2+ git submodule sync
3+ git submodule update --init --recursive
4+ git submodule foreach -q git clean -qxfd
5

Build Log 244302 (remote - stdout)
25 - 50 - 100 - Unlimited Lines

11Synchronizing submodule url for 'libraries/dph'
12Synchronizing submodule url for 'libraries/filepath'
13Synchronizing submodule url for 'libraries/haskeline'
14Synchronizing submodule url for 'libraries/hpc'
15Synchronizing submodule url for 'libraries/integer-gmp/gmp/gmp-tarballs'
16Synchronizing submodule url for 'libraries/mtl'
17Synchronizing submodule url for 'libraries/parallel'
18Synchronizing submodule url for 'libraries/parsec'
19Synchronizing submodule url for 'libraries/pretty'
20Synchronizing submodule url for 'libraries/primitive'
21Synchronizing submodule url for 'libraries/process'
22Synchronizing submodule url for 'libraries/random'
23Synchronizing submodule url for 'libraries/stm'
24Synchronizing submodule url for 'libraries/terminfo'
25Synchronizing submodule url for 'libraries/text'
26Synchronizing submodule url for 'libraries/time'
27Synchronizing submodule url for 'libraries/transformers'
28Synchronizing submodule url for 'libraries/unix'
29Synchronizing submodule url for 'libraries/vector'
30Synchronizing submodule url for 'libraries/xhtml'
31Synchronizing submodule url for 'nofib'
32Synchronizing submodule url for 'utils/haddock'
33Synchronizing submodule url for 'utils/hsc2hs'
34Submodule path 'hadrian': checked out '63a556382f4b3154ed2ce3a6c8a36f79d9b8e3b1'
35

Lease Working Copy

When
Completed at Jan 26 2018, 9:35 PM · Built instantly
Status
Passed