Build 35319

Properties

Drydock: Build

When
Completed at Sep 30 2017, 3:37 AM · Built for 22 m, 23 s
Status
Failed

Build Log 219296 (remote - stderr)
25 - 50 - 100 - Unlimited Lines

197Failed to remove file libraries/Win32/dist-install/build/System/Win32/SymbolicLink_hsc_make.exe; error= DeleteFile "libraries/Win32/dist-install/build/System/Win32/SymbolicLink_hsc_make.exe": permission denied (Access is denied.)
198Failed to remove file libraries/Win32/dist-install/build/Graphics/Win32/GDI/Brush_hsc_make.exe; error= DeleteFile "libraries/Win32/dist-install/build/Graphics/Win32/GDI/Brush_hsc_make.exe": permission denied (Access is denied.)
199Failed to remove file libraries/Win32/dist-install/build/Graphics/Win32/Window/HotKey_hsc_make.exe; error= DeleteFile "libraries/Win32/dist-install/build/Graphics/Win32/Window/HotKey_hsc_make.exe": permission denied (Access is denied.)
200Failed to remove file libraries/Win32/dist-install/build/System/Win32/FileMapping_hsc_make.exe; error= DeleteFile "libraries/Win32/dist-install/build/System/Win32/FileMapping_hsc_make.exe": permission denied (Access is denied.)
201Failed to remove file libraries/Win32/dist-install/build/System/Win32/Registry_hsc_make.exe; error= DeleteFile "libraries/Win32/dist-install/build/System/Win32/Registry_hsc_make.exe": permission denied (Access is denied.)
202Failed to remove file libraries/Win32/dist-install/build/System/Win32/Automation/Input/Mouse_hsc_make.exe; error= DeleteFile "libraries/Win32/dist-install/build/System/Win32/Automation/Input/Mouse_hsc_make.exe": permission denied (Access is denied.)
203install-info: No such file or directory for /msys64/var/drydock/workingcopy-45465/repo/glasgow-haskell-compiler/libffi/build/inst/share/info/libffi.info
204cp: cannot stat 'libffi/build/inst/include/ffi.h': No such file or directory
205rts/ghc.mk:520: rts/dist/build/.depend-v-l-debug-thr-thr_debug-thr_l.c_asm: No such file or directory
206make[1]: *** [libffi/ghc.mk:126: rts/dist/build/ffi.h] Error 1
207make[1]: *** Waiting for unfinished jobs....
208cp: cannot stat 'libffi/build/inst/include/ffitarget.h': No such file or directory
209make[1]: *** [libffi/ghc.mk:126: rts/dist/build/ffitarget.h] Error 1
210obprintf.c:59:0: warning: ISO C forbids an empty translation unit [-Wpedantic]
211 #endif /* HAVE_OBSTACK_VPRINTF */
212
213obvprintf.c:52:0: warning: ISO C forbids an empty translation unit [-Wpedantic]
214 #endif /* HAVE_OBSTACK_VPRINTF */
215
216obprntffuns.c:72:0: warning: ISO C forbids an empty translation unit [-Wpedantic]
217 #endif /* HAVE_OBSTACK_VPRINTF */
218
219libtool: warning: undefined symbols not allowed in x86_64-unknown-mingw32 shared libraries; building static only
220make: *** [Makefile:127: all] Error 2
221

Build Log 219295 (remote - stdout)
25 - 50 - 100 - Unlimited Lines

3850libtool: link: ln mpn/get_str.o .libs/libgmp.lax/lt88-get_str.o || cp mpn/get_str.o .libs/libgmp.lax/lt88-get_str.o
3851libtool: link: ln mpn/set_str.o .libs/libgmp.lax/lt89-set_str.o || cp mpn/set_str.o .libs/libgmp.lax/lt89-set_str.o
3852libtool: link: ln mpn/scan0.o .libs/libgmp.lax/lt90-scan0.o || cp mpn/scan0.o .libs/libgmp.lax/lt90-scan0.o
3853libtool: link: ln mpn/scan1.o .libs/libgmp.lax/lt91-scan1.o || cp mpn/scan1.o .libs/libgmp.lax/lt91-scan1.o
3854libtool: link: ln mpn/popcount.o .libs/libgmp.lax/lt92-popcount.o || cp mpn/popcount.o .libs/libgmp.lax/lt92-popcount.o
3855libtool: link: ln mpn/hamdist.o .libs/libgmp.lax/lt93-hamdist.o || cp mpn/hamdist.o .libs/libgmp.lax/lt93-hamdist.o
3856libtool: link: ln mpn/cmp.o .libs/libgmp.lax/lt94-cmp.o || cp mpn/cmp.o .libs/libgmp.lax/lt94-cmp.o
3857libtool: link: ln mpn/perfsqr.o .libs/libgmp.lax/lt95-perfsqr.o || cp mpn/perfsqr.o .libs/libgmp.lax/lt95-perfsqr.o
3858libtool: link: ln mpn/perfpow.o .libs/libgmp.lax/lt96-perfpow.o || cp mpn/perfpow.o .libs/libgmp.lax/lt96-perfpow.o
3859libtool: link: ln mpn/gcd.o .libs/libgmp.lax/lt97-gcd.o || cp mpn/gcd.o .libs/libgmp.lax/lt97-gcd.o
3860libtool: link: ln mpn/gcdext.o .libs/libgmp.lax/lt98-gcdext.o || cp mpn/gcdext.o .libs/libgmp.lax/lt98-gcdext.o
3861libtool: link: ln mpn/tdiv_qr.o .libs/libgmp.lax/lt99-tdiv_qr.o || cp mpn/tdiv_qr.o .libs/libgmp.lax/lt99-tdiv_qr.o
3862libtool: link: ln mpn/jacobi.o .libs/libgmp.lax/lt100-jacobi.o || cp mpn/jacobi.o .libs/libgmp.lax/lt100-jacobi.o
3863libtool: link: ln mpn/get_d.o .libs/libgmp.lax/lt101-get_d.o || cp mpn/get_d.o .libs/libgmp.lax/lt101-get_d.o
3864libtool: link: ln mpn/invert.o .libs/libgmp.lax/lt102-invert.o || cp mpn/invert.o .libs/libgmp.lax/lt102-invert.o
3865libtool: link: ln mpn/divexact.o .libs/libgmp.lax/lt103-divexact.o || cp mpn/divexact.o .libs/libgmp.lax/lt103-divexact.o
3866libtool: link: ln mpn/powm.o .libs/libgmp.lax/lt104-powm.o || cp mpn/powm.o .libs/libgmp.lax/lt104-powm.o
3867libtool: link: ln mpn/remove.o .libs/libgmp.lax/lt105-remove.o || cp mpn/remove.o .libs/libgmp.lax/lt105-remove.o
3868libtool: link: C:/msys64/var/drydock/workingcopy-45465/repo/glasgow-haskell-compiler/inplace/mingw/bin/ar.exe cq .libs/libgmp.a @.libs\\libgmp.libcmd
3869libtool: link: ranlib .libs/libgmp.a
3870libtool: link: rm -fr .libs/libgmp.lax
3871libtool: link: ( cd ".libs" && rm -f "libgmp.la" && cp -pR "../libgmp.la" "libgmp.la" )
3872make[4]: Leaving directory '/var/drydock/workingcopy-45465/repo/glasgow-haskell-compiler/libraries/integer-gmp/gmp/gmpbuild'
3873make[3]: Leaving directory '/var/drydock/workingcopy-45465/repo/glasgow-haskell-compiler/libraries/integer-gmp/gmp/gmpbuild'
3874

Drydock: Prepare tree

When
Completed at Sep 30 2017, 3:14 AM · Built for 51 s
Status
Passed

Build Log 219294 (remote - stderr)
25 - 50 - 100 - Unlimited Lines

1+ git clean -qxfd
2+ git submodule sync
3+ git submodule update --init --recursive
4+ git submodule foreach -q git clean -qxfd
5

Build Log 219293 (remote - stdout)
25 - 50 - 100 - Unlimited Lines

10Synchronizing submodule url for 'libraries/dph'
11Synchronizing submodule url for 'libraries/filepath'
12Synchronizing submodule url for 'libraries/haskeline'
13Synchronizing submodule url for 'libraries/hpc'
14Synchronizing submodule url for 'libraries/integer-gmp/gmp/gmp-tarballs'
15Synchronizing submodule url for 'libraries/mtl'
16Synchronizing submodule url for 'libraries/parallel'
17Synchronizing submodule url for 'libraries/parsec'
18Synchronizing submodule url for 'libraries/pretty'
19Synchronizing submodule url for 'libraries/primitive'
20Synchronizing submodule url for 'libraries/process'
21Synchronizing submodule url for 'libraries/random'
22Synchronizing submodule url for 'libraries/stm'
23Synchronizing submodule url for 'libraries/terminfo'
24Synchronizing submodule url for 'libraries/text'
25Synchronizing submodule url for 'libraries/time'
26Synchronizing submodule url for 'libraries/transformers'
27Synchronizing submodule url for 'libraries/unix'
28Synchronizing submodule url for 'libraries/vector'
29Synchronizing submodule url for 'libraries/xhtml'
30Synchronizing submodule url for 'nofib'
31Synchronizing submodule url for 'utils/haddock'
32Synchronizing submodule url for 'utils/hsc2hs'
33Submodule path 'libffi-tarballs': checked out 'ce3a8e2558847648ee651e63c03560958ce04887'
34

Lease Working Copy

When
Completed at Sep 30 2017, 3:14 AM · Built instantly
Status
Passed