Build 31552

Drydock: Testsuite

When
Completed at Jul 28 2017, 1:27 PM · Built for 2 s
Status
Failed

Build Log 203560 (remote - stderr)
25 - 50 - 100 - Unlimited Lines

1using THREADS=7
2cat: testsuite_summary_stage1.txt: No such file or directory
3

Build Log 203559 (remote - stdout)
25 - 50 - 100 - Unlimited Lines

1[1 of 1] Compiling Main ( ../mk/ghc-config.hs, ../mk/ghc-config.o )
2Linking ../mk/ghc-config ...
3Looks like you don't have timeout, building it first...
4Traceback (most recent call last):
5 File "../driver/runtests.py", line 46, in <module>
6 allow_abbrev=False)
7TypeError: __init__() got an unexpected keyword argument 'allow_abbrev'
8make: *** [test] Error 1
9Traceback (most recent call last):
10 File "../../driver/runtests.py", line 46, in <module>
11 allow_abbrev=False)
12TypeError: __init__() got an unexpected keyword argument 'allow_abbrev'
13make: *** [test] Error 1
14
15==== STAGE 1 TESTS ====
16

Drydock: Build

When
Completed at Jul 28 2017, 1:27 PM · Built for 27 m, 49 s
Status
Passed

Build Log 203550 (remote - stderr)
25 - 50 - 100 - Unlimited Lines

477 Call hs_init_ghc() from your main() function to set these options.
478ar: creating compiler/stage2/build/libHSghc-8.3.a
479Warning: -rtsopts and -with-rtsopts have no effect with -shared.
480 Call hs_init_ghc() from your main() function to set these options.
481Warning: -rtsopts and -with-rtsopts have no effect with -no-hs-main.
482 Call hs_init_ghc() from your main() function to set these options.
483ar: creating libraries/parallel/dist-install/build/libHSparallel-3.2.1.1.a
484Warning: -rtsopts and -with-rtsopts have no effect with -shared.
485 Call hs_init_ghc() from your main() function to set these options.
486ar: creating libraries/stm/dist-install/build/libHSstm-2.4.4.1.a
487Warning: -rtsopts and -with-rtsopts have no effect with -shared.
488 Call hs_init_ghc() from your main() function to set these options.
489ar: creating libraries/random/dist-install/build/libHSrandom-1.1.a
490Warning: -rtsopts and -with-rtsopts have no effect with -shared.
491 Call hs_init_ghc() from your main() function to set these options.
492/var/drydock/workingcopy-41145/repo/glasgow-haskell-compiler/docs/users_guide/using-optimisation.rst:: ERROR: Anonymous hyperlink mismatch: 1 references but 0 targets.
493See "backrefs" attribute for IDs.
494/var/drydock/workingcopy-41145/repo/glasgow-haskell-compiler/docs/users_guide/using-optimisation.rst:: ERROR: Anonymous hyperlink mismatch: 1 references but 0 targets.
495See "backrefs" attribute for IDs.
496None:None: WARNING: undefined label: deferred until runtime. see :ghc-flag: (if the link has no caption the label must precede a section header)
497docs/users_guide/flags-warnings.gen.rst:169: WARNING: undefined label: deferred until runtime. see :ghc-flag: (if the link has no caption the label must precede a section header)
498docs/users_guide/all-flags.gen.rst:1653: WARNING: undefined label: deferred until runtime. see :ghc-flag: (if the link has no caption the label must precede a section header)
499./configure: line 4193: --version: command not found
500./configure: line 4311: --version: command not found
501

Build Log 203549 (remote - stdout)
25 - 50 - 100 - Unlimited Lines

6267 defList (Text/XHtml/Extras.hs:91)
6268 widget (Text/XHtml/Extras.hs:99)
6269 checkbox (Text/XHtml/Extras.hs:103)
6270 hidden (Text/XHtml/Extras.hs:104)
6271 radio (Text/XHtml/Extras.hs:105)
6272 reset (Text/XHtml/Extras.hs:106)
6273 submit (Text/XHtml/Extras.hs:107)
6274 password (Text/XHtml/Extras.hs:108)
6275 textfield (Text/XHtml/Extras.hs:109)
6276 afile (Text/XHtml/Extras.hs:110)
6277 clickmap (Text/XHtml/Extras.hs:111)
6278 menu (Text/XHtml/Extras.hs:124)
6279 gui (Text/XHtml/Extras.hs:128)
6280 71% ( 5 / 7) in 'Text.XHtml'
6281 Missing documentation for:
6282 treeHtml (Text/XHtml/Debug.hs:24)
6283 treeColors (Text/XHtml/Debug.hs:64)
6284Installing library in /var/drydock/workingcopy-41145/repo/glasgow-haskell-compiler/bindisttest/install dir/lib/x86_64-linux-ghc-8.3.20170728/xhtml-3000.2.2-KpFTweFoNBLIYhuD7YXBEB
6285Registering library for xhtml-3000.2.2..
6286cleaning...
6287-------------------------------------------------------------------
6288Congratulations! This tree has compiled successfully.
6289
6290You can now test your new compiler using ./validate --testsuite-only.
6291

Drydock: Prepare tree

When
Completed at Jul 28 2017, 12:59 PM · Built for 2 s
Status
Passed
2 empty logs are hidden. Show all logs.

Build Working Copy

When
Completed at Jul 28 2017, 12:59 PM · Built instantly
Status
Passed
Description

Lease a working copy for Linux/amd64 builds.