Build 31550

Drydock: Testsuite

When
Completed at Jul 29 2017, 1:21 AM · Built for 3 s
Status
Passed

Build Log 203809 (remote - stderr)
25 - 50 - 100 - Unlimited Lines

1using THREADS=3
2cat: testsuite_summary_stage1.txt: No such file or directory
3

Build Log 203808 (remote - stdout)
25 - 50 - 100 - Unlimited Lines

1[1 of 1] Compiling Main ( ../mk/ghc-config.hs, ../mk/ghc-config.o )
2Linking ../mk/ghc-config ...
3Looks like you don't have timeout, building it first...
4Traceback (most recent call last):
5 File "../driver/runtests.py", line 46, in <module>
6 allow_abbrev=False)
7TypeError: __init__() got an unexpected keyword argument 'allow_abbrev'
8../mk/test.mk:303: recipe for target 'test' failed
9make: *** [test] Error 1
10Traceback (most recent call last):
11 File "../../driver/runtests.py", line 46, in <module>
12 allow_abbrev=False)
13TypeError: __init__() got an unexpected keyword argument 'allow_abbrev'
14../../mk/test.mk:303: recipe for target 'test' failed
15make: *** [test] Error 1
16
17==== STAGE 1 TESTS ====
18

Drydock: Build

When
Completed at Jul 29 2017, 1:21 AM · Built for 1 h, 3 m
Status
Passed

Build Log 203799 (remote - stderr)
25 - 50 - 100 - Unlimited Lines

407 Call hs_init_ghc() from your main() function to set these options.
408ar: creating compiler/stage2/build/libHSghc-8.3.a
409Warning: -rtsopts and -with-rtsopts have no effect with -shared.
410 Call hs_init_ghc() from your main() function to set these options.
411Warning: -rtsopts and -with-rtsopts have no effect with -no-hs-main.
412 Call hs_init_ghc() from your main() function to set these options.
413ar: creating libraries/parallel/dist-install/build/libHSparallel-3.2.1.1.a
414ar: creating libraries/random/dist-install/build/libHSrandom-1.1.a
415Warning: -rtsopts and -with-rtsopts have no effect with -shared.
416 Call hs_init_ghc() from your main() function to set these options.
417Warning: -rtsopts and -with-rtsopts have no effect with -shared.
418 Call hs_init_ghc() from your main() function to set these options.
419ar: creating libraries/stm/dist-install/build/libHSstm-2.4.4.1.a
420Warning: -rtsopts and -with-rtsopts have no effect with -shared.
421 Call hs_init_ghc() from your main() function to set these options.
422/var/drydock/workingcopy-41142/repo/glasgow-haskell-compiler/docs/users_guide/using-optimisation.rst:: ERROR: Anonymous hyperlink mismatch: 1 references but 0 targets.
423See "backrefs" attribute for IDs.
424/var/drydock/workingcopy-41142/repo/glasgow-haskell-compiler/docs/users_guide/using-optimisation.rst:: ERROR: Anonymous hyperlink mismatch: 1 references but 0 targets.
425See "backrefs" attribute for IDs.
426None:None: WARNING: undefined label: deferred until runtime. see :ghc-flag: (if the link has no caption the label must precede a section header)
427docs/users_guide/flags-warnings.gen.rst:169: WARNING: undefined label: deferred until runtime. see :ghc-flag: (if the link has no caption the label must precede a section header)
428docs/users_guide/all-flags.gen.rst:1653: WARNING: undefined label: deferred until runtime. see :ghc-flag: (if the link has no caption the label must precede a section header)
429./configure: line 4193: --version: command not found
430./configure: line 4311: --version: command not found
431

Build Log 203798 (remote - stdout)
25 - 50 - 100 - Unlimited Lines

6261 defList (Text/XHtml/Extras.hs:91)
6262 widget (Text/XHtml/Extras.hs:99)
6263 checkbox (Text/XHtml/Extras.hs:103)
6264 hidden (Text/XHtml/Extras.hs:104)
6265 radio (Text/XHtml/Extras.hs:105)
6266 reset (Text/XHtml/Extras.hs:106)
6267 submit (Text/XHtml/Extras.hs:107)
6268 password (Text/XHtml/Extras.hs:108)
6269 textfield (Text/XHtml/Extras.hs:109)
6270 afile (Text/XHtml/Extras.hs:110)
6271 clickmap (Text/XHtml/Extras.hs:111)
6272 menu (Text/XHtml/Extras.hs:124)
6273 gui (Text/XHtml/Extras.hs:128)
6274 71% ( 5 / 7) in 'Text.XHtml'
6275 Missing documentation for:
6276 treeHtml (Text/XHtml/Debug.hs:24)
6277 treeColors (Text/XHtml/Debug.hs:64)
6278Installing library in /var/drydock/workingcopy-41142/repo/glasgow-haskell-compiler/bindisttest/install dir/lib/i386-linux-ghc-8.3.20170728/xhtml-3000.2.2-KpFTweFoNBLIYhuD7YXBEB
6279Registering library for xhtml-3000.2.2..
6280cleaning...
6281-------------------------------------------------------------------
6282Congratulations! This tree has compiled successfully.
6283
6284You can now test your new compiler using ./validate --testsuite-only.
6285

Drydock: Prepare tree

When
Completed at Jul 29 2017, 12:17 AM · Built for 3 s
Status
Passed
2 empty logs are hidden. Show all logs.

Lease Working Copy

When
Completed at Jul 29 2017, 12:17 AM · Built instantly
Status
Passed