Build 30657

Properties

Drydock: Build

When
Completed at Jul 18 2017, 2:53 PM · Built for 28 m, 12 s
Status
Failed

Build Log 199521 (remote - stderr)
25 - 50 - 100 - Unlimited Lines

198Warning: -rtsopts and -with-rtsopts have no effect with -no-hs-main.
199 Call hs_init_ghc() from your main() function to set these options.
200Warning: -rtsopts and -with-rtsopts have no effect with -no-hs-main.
201 Call hs_init_ghc() from your main() function to set these options.
202C:\msys64\var\drydock\workingcopy-41161\repo\glasgow-haskell-compiler\utils\haddock\doc\invoking.rst:452: WARNING: unknown option: -cpp
203
204In file included from libraries\base\cbits\Win32Utils.c:12:0: error:
205
206C:/msys64/var/drydock/workingcopy-41161/repo/glasgow-haskell-compiler/inplace/mingw/x86_64-w64-mingw32/include/Shlwapi.h:66:29: error: expected identifier or '(' before 'LPSTR'
207 LWSTDAPI_(LPSTR) StrNCatA(LPSTR psz1,LPCSTR psz2,int cchMax);
208 ^~~~~
209C:/msys64/var/drydock/workingcopy-41161/repo/glasgow-haskell-compiler/inplace/mingw/x86_64-w64-mingw32/include/Shlwapi.h:67:30: error: expected identifier or '(' before 'LPWSTR'
210 LWSTDAPI_(LPWSTR) StrNCatW(LPWSTR psz1,LPCWSTR psz2,int cchMax);
211 ^~~~~~
212C:/msys64/var/drydock/workingcopy-41161/repo/glasgow-haskell-compiler/inplace/mingw/x86_64-w64-mingw32/include/Shlwapi.h:92:29: error: expected identifier or '(' before 'LPWSTR'
213 LWSTDAPI_(LPWSTR) StrCatW(LPWSTR psz1,LPCWSTR psz2);
214 ^~~~~~
215C:/msys64/var/drydock/workingcopy-41161/repo/glasgow-haskell-compiler/inplace/mingw/x86_64-w64-mingw32/include/Shlwapi.h:95:29: error: expected identifier or '(' before 'LPWSTR'
216 LWSTDAPI_(LPWSTR) StrCpyW(LPWSTR psz1,LPCWSTR psz2);
217 ^~~~~~
218`gcc.exe' failed in phase `C Compiler'. (Exit code: 1)
219make[1]: *** [libraries/base/ghc.mk:4: libraries/base/dist-install/build/cbits/Win32Utils.o] Error 1
220make[1]: *** Waiting for unfinished jobs....
221make: *** [Makefile:127: all] Error 2
222

Build Log 199520 (remote - stdout)
25 - 50 - 100 - Unlimited Lines

4481 HC [stage 1] libraries/process/dist-install/build/cbits/runProcess.o
4482 HC [stage 1] libraries/time/dist-install/build/lib/cbits/HsTime.o
4483 HC [stage 1] libraries/Win32/dist-install/build/cbits/HsGDI.o
4484 HC [stage 1] libraries/Win32/dist-install/build/cbits/HsWin32.o
4485 HC [stage 1] libraries/Win32/dist-install/build/cbits/WndProc.o
4486 HC [stage 1] libraries/Win32/dist-install/build/cbits/diatemp.o
4487 HC [stage 1] libraries/Win32/dist-install/build/cbits/dumpBMP.o
4488 HC [stage 1] libraries/Win32/dist-install/build/cbits/ellipse.o
4489 HC [stage 1] libraries/Win32/dist-install/build/cbits/errors.o
4490 HC [stage 1] libraries/Win32/dist-install/build/cbits/alphablend.o
4491 HC [stage 1] libraries/bytestring/dist-install/build/cbits/fpstring.o
4492 HC [stage 1] libraries/bytestring/dist-install/build/cbits/itoa.o
4493 HC [stage 1] libraries/base/dist-install/build/cbits/CastFloatWord.o
4494 HC [stage 1] libraries/base/dist-install/build/cbits/DarwinUtils.o
4495 HC [stage 1] libraries/base/dist-install/build/cbits/PrelIOUtils.o
4496 HC [stage 1] libraries/base/dist-install/build/cbits/SetEnv.o
4497 HC [stage 1] libraries/base/dist-install/build/cbits/WCsubst.o
4498 HC [stage 1] libraries/base/dist-install/build/cbits/Win32Utils.o
4499 HC [stage 1] libraries/base/dist-install/build/cbits/consUtils.o
4500 HC [stage 1] libraries/base/dist-install/build/cbits/iconv.o
4501 HC [stage 1] libraries/base/dist-install/build/cbits/inputReady.o
4502 HC [stage 1] libraries/base/dist-install/build/cbits/md5.o
4503 HC [stage 1] libraries/base/dist-install/build/cbits/primFloat.o
4504 HC [stage 1] libraries/base/dist-install/build/cbits/sysconf.o
4505

Drydock: Prepare tree

When
Completed at Jul 18 2017, 2:25 PM · Built for 40 s
Status
Passed
2 empty logs are hidden. Show all logs.

Lease Working Copy

When
Completed at Jul 18 2017, 2:24 PM · Built instantly
Status
Passed