Build 27654

Properties

Drydock: Build

When
Completed at May 13 2017, 9:40 PM · Built for 8 m, 18 s
Status
Failed
Description

Run patch builds.

Build Log 185051 (remote - stderr)
25 - 50 - 100 - Unlimited Lines

1024ghc/ghc.mk:112: ghc/stage2/build/.depend.haskell: No such file or directory
1025ghc/ghc.mk:112: ghc/stage2/build/.depend.c_asm: No such file or directory
1026utils/mkUserGuidePart/ghc.mk:58: utils/mkUserGuidePart/dist/build/.depend.haskell: No such file or directory
1027utils/mkUserGuidePart/ghc.mk:58: utils/mkUserGuidePart/dist/build/.depend.c_asm: No such file or directory
1028utils/compare_sizes/ghc.mk:8: utils/compare_sizes/dist-install/build/.depend.haskell: No such file or directory
1029utils/compare_sizes/ghc.mk:8: utils/compare_sizes/dist-install/build/.depend.c_asm: No such file or directory
1030iserv/ghc.mk:72: iserv/stage2/build/.depend.haskell: No such file or directory
1031iserv/ghc.mk:72: iserv/stage2/build/.depend.c_asm: No such file or directory
1032iserv/ghc.mk:99: iserv/stage2_dyn/build/.depend.haskell: No such file or directory
1033iserv/ghc.mk:99: iserv/stage2_dyn/build/.depend.c_asm: No such file or directory
1034unused terminals: 1
1035autoreconf: Entering directory `.'
1036autoreconf: configure.ac: not using Gettext
1037autoreconf: running: aclocal -I m4
1038autoreconf: configure.ac: tracing
1039autoreconf: running: libtoolize --copy
1040autoreconf: running: /usr/bin/autoconf
1041configure.ac:187: error: possibly undefined macro: LT_SYS_SYMBOL_USCORE
1042 If this token and others are legitimate, please use m4_pattern_allow.
1043 See the Autoconf documentation.
1044autoreconf: /usr/bin/autoconf failed with exit status: 1
1045make[1]: *** [libffi/stamp.ffi.static-shared.configure] Error 1
1046make[1]: *** Waiting for unfinished jobs....
1047make: *** [all] Error 2
1048

Build Log 185050 (remote - stdout)
25 - 50 - 100 - Unlimited Lines

1577 HSC2HS libraries/unix/dist-install/build/System/Posix/Env/ByteString.hs
1578 HSC2HS libraries/unix/dist-install/build/System/Posix/Process/ByteString.hs
1579 HSC2HS libraries/unix/dist-install/build/System/Posix/Temp/ByteString.hs
1580 HSC2HS libraries/unix/dist-install/build/System/Posix/Terminal/ByteString.hs
1581 HSC2HS libraries/time/dist-install/build/Data/Time/Clock/Internal/CTimespec.hs
1582 HSC2HS libraries/base/dist-install/build/GHC/ExecutionStack/Internal.hs
1583 HSC2HS libraries/base/dist-install/build/GHC/IO/Handle/Lock.hs
1584 HSC2HS libraries/base/dist-install/build/GHC/RTS/Flags.hs
1585 HSC2HS libraries/base/dist-install/build/GHC/Stack/CCS.hs
1586 HSC2HS libraries/base/dist-install/build/System/CPUTime.hs
1587 HSC2HS libraries/base/dist-install/build/System/Environment/ExecutablePath.hs
1588 HSC2HS libraries/base/dist-install/build/GHC/Event/Clock.hs
1589 HSC2HS libraries/base/dist-install/build/GHC/Event/EPoll.hs
1590 HSC2HS libraries/base/dist-install/build/GHC/Event/KQueue.hs
1591 HSC2HS libraries/base/dist-install/build/GHC/Event/Poll.hs
1592 HSC2HS libraries/base/dist-install/build/System/CPUTime/Posix/ClockGetTime.hs
1593 HSC2HS libraries/base/dist-install/build/System/CPUTime/Posix/Times.hs
1594 HSC2HS libraries/base/dist-install/build/System/CPUTime/Posix/RUsage.hs
1595libtoolize: putting macros in AC_CONFIG_MACRO_DIR, `m4'.
1596libtoolize: copying file `m4/libtool.m4'
1597libtoolize: copying file `m4/ltoptions.m4'
1598libtoolize: copying file `m4/ltsugar.m4'
1599libtoolize: copying file `m4/ltversion.m4'
1600libtoolize: copying file `m4/lt~obsolete.m4'
1601

Drydock: Prepare tree

When
Completed at May 13 2017, 9:32 PM · Built for 2 s
Status
Passed
2 empty logs are hidden. Show all logs.

Lease Working Copy

When
Completed at May 13 2017, 9:32 PM · Built instantly
Status
Passed
Description

Lease a working copy for amd64 builds.