Build 25527

Properties

Drydock: Testsuite

When
Completed at Apr 15 2017, 5:42 PM · Built for 27 s
Status
Passed

Build Log 175598 (remote - stderr)
25 - 50 - 100 - Unlimited Lines

1using THREADS=5
2cat: testsuite_summary_stage1.txt: No such file or directory
3

Build Log 175597 (remote - stdout)
25 - 50 - 100 - Unlimited Lines

4Linking Setup.exe ...
5Configuring timeout-1...
6Preprocessing executable 'timeout' for timeout-1..
7Building executable 'timeout' for timeout-1..
8[1 of 2] Compiling WinCBindings ( dist\build\timeout\timeout-tmp\WinCBindings.hs, dist\build\timeout\timeout-tmp\WinCBindings.o )
9[2 of 2] Compiling Main ( timeout.hs, dist\build\timeout\timeout-tmp\Main.o )
10Linking dist\build\timeout\timeout.exe ...
11C:/msys64/var/drydock/workingcopy-41149/repo/glasgow-haskell-compiler/inplace/mingw/bin/ld.exe: final link failed: No space left on device
12collect2.exe: error: ld returned 1 exit status
13`gcc.exe' failed in phase `Linker'. (Exit code: 1)
14make[1]: *** [Makefile:42: install-inplace/bin/timeout] Error 1
15make: *** [../mk/test.mk:293: ../timeout/install-inplace/bin/timeout.exe] Error 2
16Looks like you don't have timeout, building it first...
17Configuring timeout-1...
18Preprocessing executable 'timeout' for timeout-1..
19Building executable 'timeout' for timeout-1..
20Linking dist\build\timeout\timeout.exe ...
21C:/msys64/var/drydock/workingcopy-41149/repo/glasgow-haskell-compiler/inplace/mingw/bin/ld.exe: final link failed: No space left on device
22collect2.exe: error: ld returned 1 exit status
23`gcc.exe' failed in phase `Linker'. (Exit code: 1)
24make[1]: *** [Makefile:42: install-inplace/bin/timeout] Error 1
25make: *** [../../mk/test.mk:293: ../../timeout/install-inplace/bin/timeout.exe] Error 2
26
27==== STAGE 1 TESTS ====
28

Drydock: Build

When
Completed at Apr 15 2017, 5:42 PM · Built for 1 h, 1 m
Status
Passed

Build Log 175588 (remote - stderr)
25 - 50 - 100 - Unlimited Lines

1091C:\msys64\var\drydock\workingcopy-41149\repo\glasgow-haskell-compiler\docs\users_guide\separate_compilation.rst:508: WARNING: Could not lex literal_block as "haskell". Highlighting skipped.
1092docs/users_guide/flags-warnings.gen.rst:166: WARNING: undefined label: deferred until runtime. see :ghc-flag: (if the link has no caption the label must precede a section header)
1093docs/users_guide/all-flags.gen.rst:1644: WARNING: undefined label: deferred until runtime. see :ghc-flag: (if the link has no caption the label must precede a section header)
1094WARNING: cache is out of date: C:\msys64\var\drydock\workingcopy-41149\repo\glasgow-haskell-compiler\bindisttest\install dir\lib\package.conf.d\package.cache
1095ghc will see an old view of this package db. Use 'ghc-pkg recache' to fix.
1096WARNING: cache is out of date: C:\msys64\var\drydock\workingcopy-41149\repo\glasgow-haskell-compiler\bindisttest\install dir\lib\package.conf.d\package.cache
1097ghc will see an old view of this package db. Use 'ghc-pkg recache' to fix.
1098
1099<no location info>: warning: [-Wmissing-home-modules]
1100 Modules are not listed in command line: Text.XHtml
1101 Text.XHtml.BlockTable
1102 Text.XHtml.Debug
1103 Text.XHtml.Extras
1104 Text.XHtml.Frameset
1105 Text.XHtml.Frameset.Attributes
1106 Text.XHtml.Frameset.Elements
1107 Text.XHtml.Internals
1108 Text.XHtml.Strict
1109 Text.XHtml.Strict.Attributes
1110 Text.XHtml.Strict.Elements
1111 Text.XHtml.Table
1112 Text.XHtml.Transitional
1113 Text.XHtml.Transitional.Attributes
1114 Text.XHtml.Transitional.Elements
1115

Build Log 175587 (remote - stdout)
25 - 50 - 100 - Unlimited Lines

7274 defList (Text\XHtml\Extras.hs:95)
7275 widget (Text\XHtml\Extras.hs:103)
7276 checkbox (Text\XHtml\Extras.hs:107)
7277 hidden (Text\XHtml\Extras.hs:108)
7278 radio (Text\XHtml\Extras.hs:109)
7279 reset (Text\XHtml\Extras.hs:110)
7280 submit (Text\XHtml\Extras.hs:111)
7281 password (Text\XHtml\Extras.hs:112)
7282 textfield (Text\XHtml\Extras.hs:113)
7283 afile (Text\XHtml\Extras.hs:114)
7284 clickmap (Text\XHtml\Extras.hs:115)
7285 menu (Text\XHtml\Extras.hs:128)
7286 gui (Text\XHtml\Extras.hs:132)
7287 71% ( 5 / 7) in 'Text.XHtml'
7288 Missing documentation for:
7289 treeHtml (Text\XHtml\Debug.hs:28)
7290 treeColors (Text\XHtml\Debug.hs:68)
7291Installing library in C:/msys64/var/drydock/workingcopy-41149/repo/glasgow-haskell-compiler/bindisttest/install dir\x86_64-windows-ghc-8.3.20170415\xhtml-3000.2.1-2FUJjLySnNJOhR5uKsyvz
7292Registering library for xhtml-3000.2.1..
7293cleaning...
7294-------------------------------------------------------------------
7295Congratulations! This tree has compiled successfully.
7296
7297You can now test your new compiler using ./validate --testsuite-only.
7298

Drydock: Prepare tree

When
Completed at Apr 15 2017, 4:40 PM · Built for 30 s
Status
Passed
2 empty logs are hidden. Show all logs.

Lease Working Copy

When
Completed at Apr 15 2017, 4:40 PM · Built instantly
Status
Passed