Build 2239

Properties

Run GHC Validate Build

When
Completed at Nov 23 2014, 2:00 AM · Built for 2 m, 39 s
Status
Failed
Description

Run GHC ./validate build.

Build Log 108071 (remote - stderr)
25 - 50 - 100 - Unlimited Lines

7genprimopcode: parse error at "Parse error at line 2358, column 1"
8genprimopcode: parse error at "Parse error at line 2358, column 1"
9make[1]: *** [compiler/stage1/build/primop-commutable.hs-incl] Error 1
10make[1]: *** Deleting file `compiler/stage1/build/primop-commutable.hs-incl'
11make[1]: *** [compiler/stage1/build/primop-tag.hs-incl] Error 1
12make[1]: *** Deleting file `compiler/stage1/build/primop-tag.hs-incl'
13make[1]: *** [compiler/stage1/build/primop-code-size.hs-incl] Error 1
14make[1]: *** Deleting file `compiler/stage1/build/primop-code-size.hs-incl'
15genprimopcode: parse error at "Parse error at line 2358, column 1"
16make[1]: *** [compiler/stage1/build/primop-has-side-effects.hs-incl] Error 1
17make[1]: *** Deleting file `compiler/stage1/build/primop-has-side-effects.hs-incl'
18genprimopcode: parse error at "Parse error at line 2358, column 1"
19genprimopcode: parse error at "Parse error at line 2358, column 1"
20make[1]: *** [compiler/stage1/build/primop-data-decl.hs-incl] Error 1
21make[1]: *** Deleting file `compiler/stage1/build/primop-data-decl.hs-incl'
22make[1]: *** [compiler/stage1/build/primop-can-fail.hs-incl] Error 1
23make[1]: *** Deleting file `compiler/stage1/build/primop-can-fail.hs-incl'
24genprimopcode: parse error at "Parse error at line 2358, column 1"
25make[1]: *** [compiler/stage1/build/primop-out-of-line.hs-incl] Error 1
26make[1]: *** Deleting file `compiler/stage1/build/primop-out-of-line.hs-incl'
27unused rules: 1
28shift/reduce conflicts: 60
29reduce/reduce conflicts: 16
30make: *** [all] Error 2
31

Build Log 108070 (remote - stdout)
25 - 50 - 100 - Unlimited Lines

1Now building B2239: patch rGHC/D350:1682
2 - Base directory: /srv/builds/patches/rGHC/B2239-D350-1682
3 - Cloning repository........... OK (took about 40.014115864 seconds)
4 - Updating HEAD and grabbing submodules......... OK (took about 30.010562646 seconds)
5 - Applying diff 1682 via Arcanist... OK (took about 2.628378917 seconds)
6
7OK, starting build on Sun Nov 23 07:57:25 UTC 2014
8 - Using 8 CPUs on Linux phab-ghc07 3.13.0-33-generic #58-Ubuntu SMP Tue Jul 29 16:45:05 UTC 2014 x86_64 x86_64 x86_64 GNU/Linux
9 - Running validate.......ERROR: validate failed!
10 - LZMA compressing full build logs.... OK (took about 5.003215881 seconds)
11

Lease GHC Build Machine

When
Completed at Nov 23 2014, 1:57 AM · Built for 1 s
Status
Passed
Description

Lease a build machine to perform a GHC build.