Build 2238

Properties

Run GHC Validate Build

When
Completed at Nov 23 2014, 1:48 AM · Built for 2 m, 39 s
Status
Failed
Description

Run GHC ./validate build.

Build Log 108069 (remote - stderr)
25 - 50 - 100 - Unlimited Lines

7make[1]: *** Waiting for unfinished jobs....
8genprimopcode: parse error at "Parse error at line 2359, column 1"
9genprimopcode: parse error at "Parse error at line 2359, column 1"
10make[1]: *** [compiler/stage1/build/primop-code-size.hs-incl] Error 1
11make[1]: *** Deleting file `compiler/stage1/build/primop-code-size.hs-incl'
12make[1]: *** [compiler/stage1/build/primop-data-decl.hs-incl] Error 1
13make[1]: *** Deleting file `compiler/stage1/build/primop-data-decl.hs-incl'
14make[1]: *** [compiler/stage1/build/primop-has-side-effects.hs-incl] Error 1
15make[1]: *** Deleting file `compiler/stage1/build/primop-has-side-effects.hs-incl'
16make[1]: *** [compiler/stage1/build/primop-commutable.hs-incl] Error 1
17make[1]: *** Deleting file `compiler/stage1/build/primop-commutable.hs-incl'
18genprimopcode: parse error at "Parse error at line 2359, column 1"
19make[1]: *** [compiler/stage1/build/primop-list.hs-incl] Error 1
20make[1]: *** Deleting file `compiler/stage1/build/primop-list.hs-incl'
21genprimopcode: parse error at "Parse error at line 2359, column 1"
22make[1]: *** [compiler/stage1/build/primop-tag.hs-incl] Error 1
23make[1]: *** Deleting file `compiler/stage1/build/primop-tag.hs-incl'
24genprimopcode: parse error at "Parse error at line 2359, column 1"
25make[1]: *** [compiler/stage1/build/primop-can-fail.hs-incl] Error 1
26make[1]: *** Deleting file `compiler/stage1/build/primop-can-fail.hs-incl'
27unused rules: 1
28shift/reduce conflicts: 60
29reduce/reduce conflicts: 16
30make: *** [all] Error 2
31

Build Log 108068 (remote - stdout)
25 - 50 - 100 - Unlimited Lines

1Now building B2238: patch rGHC/D350:1681
2 - Base directory: /srv/builds/patches/rGHC/B2238-D350-1681
3 - Cloning repository.......... OK (took about 35.013065822 seconds)
4 - Updating HEAD and grabbing submodules.......... OK (took about 35.011700982 seconds)
5 - Applying diff 1681 via Arcanist... OK (took about 2.605410344 seconds)
6
7OK, starting build on Sun Nov 23 07:45:33 UTC 2014
8 - Using 8 CPUs on Linux phab-ghc07 3.13.0-33-generic #58-Ubuntu SMP Tue Jul 29 16:45:05 UTC 2014 x86_64 x86_64 x86_64 GNU/Linux
9 - Running validate.......ERROR: validate failed!
10 - LZMA compressing full build logs.... OK (took about 5.003478035 seconds)
11

Lease GHC Build Machine

When
Completed at Nov 23 2014, 1:45 AM · Built for 1 s
Status
Passed
Description

Lease a build machine to perform a GHC build.