Build 18808

Properties

Drydock: Build

When
Completed at Jan 21 2017, 1:32 PM · Built for 24 m, 22 s
Status
Failed
Description

Run patch builds.

Build Log 148171 (remote - stderr)
25 - 50 - 100 - Unlimited Lines

25649 Size = {terms: 40,682, types: 71,933, coercions: 45,148}
25650WARNING: file compiler/simplCore/OccurAnal.hs, line 67
25651 Glomming in Main: [srS2 :->, srTh :-> OnceL!]
25652WARNING: file compiler/simplCore/SimplCore.hs, line 666
25653 Simplifier bailing out after 4 iterations [6083, 674, 56, 23]
25654 Size = {terms: 6,279, types: 10,174, coercions: 1,694}
25655WARNING: file compiler/main/TidyPgm.hs, line 1254 lvl_sEV3
25656Warning: -rtsopts and -with-rtsopts have no effect with -no-hs-main.
25657 Call hs_init_ghc() from your main() function to set these options.
25658/usr/bin/ar: creating libraries/parallel/dist-install/build/libHSparallel-3.2.1.0.a
25659Warning: -rtsopts and -with-rtsopts have no effect with -shared.
25660 Call hs_init_ghc() from your main() function to set these options.
25661/usr/bin/ar: creating libraries/stm/dist-install/build/libHSstm-2.4.4.1.a
25662/usr/bin/ar: creating libraries/random/dist-install/build/libHSrandom-1.1.a
25663Warning: -rtsopts and -with-rtsopts have no effect with -shared.
25664 Call hs_init_ghc() from your main() function to set these options.
25665
25666utils/haddock/haddock-api/src/Haddock/Convert.hs:37:31: error:
25667 Module ‘TysPrim’ does not export ‘unliftedTypeKindTyConName’
25668 |
2566937 | import TysPrim ( alphaTyVars, unliftedTypeKindTyConName )
25670 | ^^^^^^^^^^^^^^^^^^^^^^^^^
25671
25672utils/haddock/haddock-api/src/Haddock/Convert.hs:40:34: error:
25673 Module ‘PrelNames’ does not export ‘ptrRepLiftedDataConKey’
25674 |
2567540 | , tYPETyConKey, ptrRepLiftedDataConKey, ptrRepUnliftedDataConKey )
25676 | ^^^^^^^^^^^^^^^^^^^^^^
25677
25678utils/haddock/haddock-api/src/Haddock/Convert.hs:40:58: error:
25679 Module ‘PrelNames’ does not export ‘ptrRepUnliftedDataConKey’
25680 |
2568140 | , tYPETyConKey, ptrRepLiftedDataConKey, ptrRepUnliftedDataConKey )
25682 | ^^^^^^^^^^^^^^^^^^^^^^^^
25683make[1]: *** [utils/haddock/dist/build/Haddock/Convert.dyn_o] Error 1
25684make[1]: *** Waiting for unfinished jobs....
25685
25686utils/haddock/haddock-api/src/Haddock/Backends/LaTeX.hs:960:66: error:
25687 • Couldn't match type ‘GenLocated SrcSpan HsIPName’ with ‘HsIPName’
25688 Expected type: HsIPName
25689 Actual type: Located HsIPName
25690 • In the first argument of ‘ppIPName’, namely ‘n’
25691 In the first argument of ‘(<+>)’, namely ‘ppIPName n’
25692 In the first argument of ‘(<+>)’, namely ‘ppIPName n <+> dcolon u’
25693 |
25694960 | ppr_mono_ty _ (HsIParamTy n ty) u = brackets (ppIPName n <+> dcolon u <+> ppr_mono_lty pREC_TOP ty u)
25695 | ^
25696make[1]: *** [utils/haddock/dist/build/Haddock/Backends/LaTeX.dyn_o] Error 1
25697make: *** [all] Error 2
25698

Build Log 148170 (remote - stdout)
25 - 50 - 100 - Unlimited Lines

6806 INLINE binder is (non-rule) loop breaker: $w$srandomRFloating2
6807libraries/random/System/Random.hs:403:1: warning:
6808 [RHS of $w$srandomRFloating1 :: Float#
6809 -> Float# -> StdGen -> (# CFloat, StdGen #)]
6810 INLINE binder is (non-rule) loop breaker: $w$srandomRFloating1
6811libraries/random/System/Random.hs:403:1: warning:
6812 [RHS of $w$srandomRFloating3 :: Float#
6813 -> Float# -> StdGen -> (# Float, StdGen #)]
6814 INLINE binder is (non-rule) loop breaker: $w$srandomRFloating3
6815libraries/random/System/Random.hs:403:1: warning:
6816 [RHS of $w$srandomRFloating :: Double#
6817 -> Double# -> StdGen -> (# CDouble, StdGen #)]
6818 INLINE binder is (non-rule) loop breaker: $w$srandomRFloating
6819
6820 HC [stage 2] utils/haddock/dist/build/Data/Attoparsec/Internal.dyn_o
6821 HC [stage 2] libraries/stm/dist-install/build/Control/Concurrent/STM/TSem.o
6822 HC [stage 2] utils/mkUserGuidePart/dist/build/Main.dyn_o
6823 AR libraries/stm/dist-install/build/libHSstm-2.4.4.1.a
6824*** Core Lint warnings : in result of CorePrep ***
6825libraries/random/System/Random.hs:403:1: warning:
6826 [RHS of $w$srandomRFloating2 :: Double#
6827 -> Double# -> StdGen -> (# Double, StdGen #)]
6828 INLINE binder is (non-rule) loop breaker: $w$srandomRFloating2
6829libraries/random/System/Random.hs:403:1: warning:
6830 [RHS of $w$srandomRFloating1 :: Float#
6831 -> Float# -> StdGen -> (# CFloat, StdGen #)]
6832 INLINE binder is (non-rule) loop breaker: $w$srandomRFloating1
6833libraries/random/System/Random.hs:403:1: warning:
6834 [RHS of $w$srandomRFloating3 :: Float#
6835 -> Float# -> StdGen -> (# Float, StdGen #)]
6836 INLINE binder is (non-rule) loop breaker: $w$srandomRFloating3
6837libraries/random/System/Random.hs:403:1: warning:
6838 [RHS of $w$srandomRFloating :: Double#
6839 -> Double# -> StdGen -> (# CDouble, StdGen #)]
6840 INLINE binder is (non-rule) loop breaker: $w$srandomRFloating
6841
6842 HC [stage 2] utils/haddock/dist/build/Haddock/Options.dyn_o
6843 HC [stage 2] utils/haddock/dist/build/Haddock/InterfaceFile.dyn_o
6844 HC [stage 2] utils/haddock/dist/build/Data/Attoparsec/Combinator.dyn_o
6845 HC [stage 2] utils/haddock/dist/build/Haddock/Backends/Xhtml/Utils.dyn_o
6846 HC [stage 2] utils/haddock/dist/build/Haddock/Backends/Hoogle.dyn_o
6847 HC [stage 2] utils/haddock/dist/build/Haddock/Doc.dyn_o
6848 HC [stage 2] libraries/stm/dist-install/build/libHSstm-2.4.4.1-ghc8.1.20170121.so
6849 AR libraries/random/dist-install/build/libHSrandom-1.1.a
6850 HC [stage 2] utils/mkUserGuidePart/dist/build/tmp/mkUserGuidePart
6851 HC [stage 2] utils/haddock/dist/build/Data/Attoparsec/ByteString/Internal.dyn_o
6852 HC [stage 2] utils/haddock/dist/build/Haddock/Convert.dyn_o
6853 HC [stage 2] utils/haddock/dist/build/Haddock/Backends/Hyperlinker/Utils.dyn_o
6854 HC [stage 2] utils/haddock/dist/build/Haddock/Backends/LaTeX.dyn_o
6855

Drydock: Prepare tree

When
Completed at Jan 21 2017, 1:08 PM · Built for 1 s
Status
Passed
2 empty logs are hidden. Show all logs.

Lease Working Copy

When
Completed at Jan 21 2017, 1:08 PM · Built instantly
Status
Passed
Description

Lease a working copy for amd64 builds.