Build 18808

Properties

Drydock: Build

When
Completed at Jan 21 2017, 1:32 PM · Built for 24 m, 22 s
Status
Failed
Description

Run patch builds.

Build Log 148171 (remote - stderr)
25 - 50 - 100 - Unlimited Lines

25599 No absent value for MutVar# RealWorld (Maybe FastZString)
25600WARNING: file compiler/simplCore/SimplCore.hs, line 666
25601 Simplifier bailing out after 4 iterations [279, 38, 1, 1]
25602 Size = {terms: 4,468, types: 10,539, coercions: 9,722}
25603WARNING: file compiler/stgSyn/CoreToStg.hs, line 287
25604 $fFunctorGHCi True False
25605WARNING: file compiler/simplCore/SimplCore.hs, line 666
25606 Simplifier bailing out after 4 iterations [1464, 129, 22, 25]
25607 Size = {terms: 1,553, types: 2,369, coercions: 472}
25608WARNING: file compiler/stranal/WwLib.hs, line 777
25609 No absent value for MutVar# RealWorld (Maybe FastZString)
25610WARNING: file compiler/specialise/Specialise.hs, line 1174
25611 Missed specialisation opportunity for $w$c<*>
25612 [] 2 [] 1 [0]
25613WARNING: file compiler/simplCore/OccurAnal.hs, line 67
25614 Glomming in GHCi.UI:
25615 [sYMh :->, sYR2 :->, sZ9G :->, sZa4 :->, sZa8 :->, sZad :->,
25616 sZam :->, sZaw :->, sZax :->, sZay :->, sZaz :->, sZaA :->,
25617 sZaB :->, sZaC :->, sZaD :->, sZbb :->, sZbj :->, sZbk :->]
25618WARNING: file compiler/simplCore/SimplEnv.hs, line 506 karg_s197S
25619WARNING: file compiler/simplCore/SimplCore.hs, line 666
25620 Simplifier bailing out after 4 iterations [122302, 10734, 3056, 403]
25621 Size = {terms: 37,655, types: 68,908, coercions: 62,756}
25622WARNING: file compiler/simplCore/SimplCore.hs, line 666
25623 Simplifier bailing out after 4 iterations [7346, 388, 249, 21]
25624 Size = {terms: 36,682, types: 68,031, coercions: 54,709}
25625WARNING: file compiler/simplCore/SimplCore.hs, line 666
25626 Simplifier bailing out after 4 iterations [6266, 1296, 69, 73]
25627 Size = {terms: 41,412, types: 76,272, coercions: 55,155}
25628WARNING: file compiler/simplCore/SimplCore.hs, line 666
25629 Simplifier bailing out after 4 iterations [1264, 2456, 87, 19]
25630 Size = {terms: 40,575, types: 72,860, coercions: 45,120}
25631WARNING: file compiler/stranal/WwLib.hs, line 777
25632 No absent value for MutVar# RealWorld (Maybe FastZString)
25633WARNING: file compiler/stranal/WwLib.hs, line 777
25634 No absent value for State# RealWorld
25635WARNING: file compiler/stranal/WwLib.hs, line 777
25636 No absent value for MutVar# RealWorld (Maybe FastZString)
25637WARNING: file compiler/stranal/WwLib.hs, line 777
25638 No absent value for MutVar# RealWorld (Maybe FastZString)
25639WARNING: file compiler/stranal/WwLib.hs, line 777
25640 No absent value for MutVar# RealWorld (Maybe FastZString)
25641WARNING: file compiler/stranal/WwLib.hs, line 777
25642 No absent value for MutVar# RealWorld (Maybe FastZString)
25643WARNING: file compiler/stranal/WwLib.hs, line 777
25644 No absent value for State# RealWorld
25645WARNING: file compiler/stranal/WwLib.hs, line 777
25646 No absent value for State# RealWorld
25647WARNING: file compiler/simplCore/SimplCore.hs, line 666
25648 Simplifier bailing out after 4 iterations [4288, 64, 13, 4]
25649 Size = {terms: 40,682, types: 71,933, coercions: 45,148}
25650WARNING: file compiler/simplCore/OccurAnal.hs, line 67
25651 Glomming in Main: [srS2 :->, srTh :-> OnceL!]
25652WARNING: file compiler/simplCore/SimplCore.hs, line 666
25653 Simplifier bailing out after 4 iterations [6083, 674, 56, 23]
25654 Size = {terms: 6,279, types: 10,174, coercions: 1,694}
25655WARNING: file compiler/main/TidyPgm.hs, line 1254 lvl_sEV3
25656Warning: -rtsopts and -with-rtsopts have no effect with -no-hs-main.
25657 Call hs_init_ghc() from your main() function to set these options.
25658/usr/bin/ar: creating libraries/parallel/dist-install/build/libHSparallel-3.2.1.0.a
25659Warning: -rtsopts and -with-rtsopts have no effect with -shared.
25660 Call hs_init_ghc() from your main() function to set these options.
25661/usr/bin/ar: creating libraries/stm/dist-install/build/libHSstm-2.4.4.1.a
25662/usr/bin/ar: creating libraries/random/dist-install/build/libHSrandom-1.1.a
25663Warning: -rtsopts and -with-rtsopts have no effect with -shared.
25664 Call hs_init_ghc() from your main() function to set these options.
25665
25666utils/haddock/haddock-api/src/Haddock/Convert.hs:37:31: error:
25667 Module ‘TysPrim’ does not export ‘unliftedTypeKindTyConName’
25668 |
2566937 | import TysPrim ( alphaTyVars, unliftedTypeKindTyConName )
25670 | ^^^^^^^^^^^^^^^^^^^^^^^^^
25671
25672utils/haddock/haddock-api/src/Haddock/Convert.hs:40:34: error:
25673 Module ‘PrelNames’ does not export ‘ptrRepLiftedDataConKey’
25674 |
2567540 | , tYPETyConKey, ptrRepLiftedDataConKey, ptrRepUnliftedDataConKey )
25676 | ^^^^^^^^^^^^^^^^^^^^^^
25677
25678utils/haddock/haddock-api/src/Haddock/Convert.hs:40:58: error:
25679 Module ‘PrelNames’ does not export ‘ptrRepUnliftedDataConKey’
25680 |
2568140 | , tYPETyConKey, ptrRepLiftedDataConKey, ptrRepUnliftedDataConKey )
25682 | ^^^^^^^^^^^^^^^^^^^^^^^^
25683make[1]: *** [utils/haddock/dist/build/Haddock/Convert.dyn_o] Error 1
25684make[1]: *** Waiting for unfinished jobs....
25685
25686utils/haddock/haddock-api/src/Haddock/Backends/LaTeX.hs:960:66: error:
25687 • Couldn't match type ‘GenLocated SrcSpan HsIPName’ with ‘HsIPName’
25688 Expected type: HsIPName
25689 Actual type: Located HsIPName
25690 • In the first argument of ‘ppIPName’, namely ‘n’
25691 In the first argument of ‘(<+>)’, namely ‘ppIPName n’
25692 In the first argument of ‘(<+>)’, namely ‘ppIPName n <+> dcolon u’
25693 |
25694960 | ppr_mono_ty _ (HsIParamTy n ty) u = brackets (ppIPName n <+> dcolon u <+> ppr_mono_lty pREC_TOP ty u)
25695 | ^
25696make[1]: *** [utils/haddock/dist/build/Haddock/Backends/LaTeX.dyn_o] Error 1
25697make: *** [all] Error 2
25698

Build Log 148170 (remote - stdout)
25 - 50 - 100 - Unlimited Lines

6756 INLINE binder is (non-rule) loop breaker: $wrandomRFloating_sdQP
6757
6758 HC [stage 2] utils/ghctags/dist-install/build/tmp/ghctags
6759*** Core Lint warnings : in result of Demand analysis ***
6760libraries/random/System/Random.hs:403:1: warning:
6761 [RHS of $w$srandomRFloating_sdLm :: Double#
6762 -> Double# -> StdGen -> (# Double, StdGen #)]
6763 INLINE binder is (non-rule) loop breaker: $w$srandomRFloating_sdLm
6764libraries/random/System/Random.hs:403:1: warning:
6765 [RHS of $w$srandomRFloating_sdOZ :: Float#
6766 -> Float# -> StdGen -> (# CFloat, StdGen #)]
6767 INLINE binder is (non-rule) loop breaker: $w$srandomRFloating_sdOZ
6768libraries/random/System/Random.hs:403:1: warning:
6769 [RHS of $w$srandomRFloating_sdPu :: Float#
6770 -> Float# -> StdGen -> (# Float, StdGen #)]
6771 INLINE binder is (non-rule) loop breaker: $w$srandomRFloating_sdPu
6772libraries/random/System/Random.hs:403:1: warning:
6773 [RHS of $w$srandomRFloating_sdQw :: Double#
6774 -> Double# -> StdGen -> (# CDouble, StdGen #)]
6775 INLINE binder is (non-rule) loop breaker: $w$srandomRFloating_sdQw
6776libraries/random/System/Random.hs:403:1: warning:
6777 [RHS of $wrandomRFloating_sdQP :: forall a g.
6778 (Fractional a, Ord a, Random a, RandomGen g) =>
6779 a -> a -> g -> (# a, g #)]
6780 INLINE binder is (non-rule) loop breaker: $wrandomRFloating_sdQP
6781
6782 HC [stage 2] utils/mkUserGuidePart/dist/build/Options.dyn_o
6783*** Core Lint warnings : in result of Tidy Core ***
6784libraries/random/System/Random.hs:403:1: warning:
6785 [RHS of $w$srandomRFloating2 :: Double#
6786 -> Double# -> StdGen -> (# Double, StdGen #)]
6787 INLINE binder is (non-rule) loop breaker: $w$srandomRFloating2
6788libraries/random/System/Random.hs:403:1: warning:
6789 [RHS of $w$srandomRFloating1 :: Float#
6790 -> Float# -> StdGen -> (# CFloat, StdGen #)]
6791 INLINE binder is (non-rule) loop breaker: $w$srandomRFloating1
6792libraries/random/System/Random.hs:403:1: warning:
6793 [RHS of $w$srandomRFloating3 :: Float#
6794 -> Float# -> StdGen -> (# Float, StdGen #)]
6795 INLINE binder is (non-rule) loop breaker: $w$srandomRFloating3
6796libraries/random/System/Random.hs:403:1: warning:
6797 [RHS of $w$srandomRFloating :: Double#
6798 -> Double# -> StdGen -> (# CDouble, StdGen #)]
6799 INLINE binder is (non-rule) loop breaker: $w$srandomRFloating
6800
6801 HC [stage 2] libraries/parallel/dist-install/build/libHSparallel-3.2.1.0-ghc8.1.20170121.so
6802*** Core Lint warnings : in result of CorePrep ***
6803libraries/random/System/Random.hs:403:1: warning:
6804 [RHS of $w$srandomRFloating2 :: Double#
6805 -> Double# -> StdGen -> (# Double, StdGen #)]
6806 INLINE binder is (non-rule) loop breaker: $w$srandomRFloating2
6807libraries/random/System/Random.hs:403:1: warning:
6808 [RHS of $w$srandomRFloating1 :: Float#
6809 -> Float# -> StdGen -> (# CFloat, StdGen #)]
6810 INLINE binder is (non-rule) loop breaker: $w$srandomRFloating1
6811libraries/random/System/Random.hs:403:1: warning:
6812 [RHS of $w$srandomRFloating3 :: Float#
6813 -> Float# -> StdGen -> (# Float, StdGen #)]
6814 INLINE binder is (non-rule) loop breaker: $w$srandomRFloating3
6815libraries/random/System/Random.hs:403:1: warning:
6816 [RHS of $w$srandomRFloating :: Double#
6817 -> Double# -> StdGen -> (# CDouble, StdGen #)]
6818 INLINE binder is (non-rule) loop breaker: $w$srandomRFloating
6819
6820 HC [stage 2] utils/haddock/dist/build/Data/Attoparsec/Internal.dyn_o
6821 HC [stage 2] libraries/stm/dist-install/build/Control/Concurrent/STM/TSem.o
6822 HC [stage 2] utils/mkUserGuidePart/dist/build/Main.dyn_o
6823 AR libraries/stm/dist-install/build/libHSstm-2.4.4.1.a
6824*** Core Lint warnings : in result of CorePrep ***
6825libraries/random/System/Random.hs:403:1: warning:
6826 [RHS of $w$srandomRFloating2 :: Double#
6827 -> Double# -> StdGen -> (# Double, StdGen #)]
6828 INLINE binder is (non-rule) loop breaker: $w$srandomRFloating2
6829libraries/random/System/Random.hs:403:1: warning:
6830 [RHS of $w$srandomRFloating1 :: Float#
6831 -> Float# -> StdGen -> (# CFloat, StdGen #)]
6832 INLINE binder is (non-rule) loop breaker: $w$srandomRFloating1
6833libraries/random/System/Random.hs:403:1: warning:
6834 [RHS of $w$srandomRFloating3 :: Float#
6835 -> Float# -> StdGen -> (# Float, StdGen #)]
6836 INLINE binder is (non-rule) loop breaker: $w$srandomRFloating3
6837libraries/random/System/Random.hs:403:1: warning:
6838 [RHS of $w$srandomRFloating :: Double#
6839 -> Double# -> StdGen -> (# CDouble, StdGen #)]
6840 INLINE binder is (non-rule) loop breaker: $w$srandomRFloating
6841
6842 HC [stage 2] utils/haddock/dist/build/Haddock/Options.dyn_o
6843 HC [stage 2] utils/haddock/dist/build/Haddock/InterfaceFile.dyn_o
6844 HC [stage 2] utils/haddock/dist/build/Data/Attoparsec/Combinator.dyn_o
6845 HC [stage 2] utils/haddock/dist/build/Haddock/Backends/Xhtml/Utils.dyn_o
6846 HC [stage 2] utils/haddock/dist/build/Haddock/Backends/Hoogle.dyn_o
6847 HC [stage 2] utils/haddock/dist/build/Haddock/Doc.dyn_o
6848 HC [stage 2] libraries/stm/dist-install/build/libHSstm-2.4.4.1-ghc8.1.20170121.so
6849 AR libraries/random/dist-install/build/libHSrandom-1.1.a
6850 HC [stage 2] utils/mkUserGuidePart/dist/build/tmp/mkUserGuidePart
6851 HC [stage 2] utils/haddock/dist/build/Data/Attoparsec/ByteString/Internal.dyn_o
6852 HC [stage 2] utils/haddock/dist/build/Haddock/Convert.dyn_o
6853 HC [stage 2] utils/haddock/dist/build/Haddock/Backends/Hyperlinker/Utils.dyn_o
6854 HC [stage 2] utils/haddock/dist/build/Haddock/Backends/LaTeX.dyn_o
6855

Drydock: Prepare tree

When
Completed at Jan 21 2017, 1:08 PM · Built for 1 s
Status
Passed
2 empty logs are hidden. Show all logs.

Lease Working Copy

When
Completed at Jan 21 2017, 1:08 PM · Built instantly
Status
Passed
Description

Lease a working copy for amd64 builds.