Build 18806

Properties

Drydock: Build

When
Completed at Jan 21 2017, 3:38 PM · Built for 47 m, 42 s
Status
Failed

Build Log 148213 (remote - stderr)
25 - 50 - 100 - Unlimited Lines

24873 No absent value for State# RealWorld
24874WARNING: file compiler\stranal\WwLib.hs, line 777
24875 No absent value for State# RealWorld
24876WARNING: file compiler\simplCore\SimplCore.hs, line 666
24877 Simplifier bailing out after 4 iterations [4288, 64, 13, 4]
24878 Size = {terms: 40,407, types: 71,629, coercions: 45,113}
24879WARNING: file compiler\simplCore\OccurAnal.hs, line 67
24880 Glomming in Main: [srlF :->, srmU :-> OnceL!]
24881WARNING: file compiler\simplCore\SimplCore.hs, line 666
24882 Simplifier bailing out after 4 iterations [6107, 676, 56, 23]
24883 Size = {terms: 6,319, types: 10,232, coercions: 1,712}
24884WARNING: file compiler\main\TidyPgm.hs, line 1254 lvl_sF69
24885Warning: -rtsopts and -with-rtsopts have no effect with -no-hs-main.
24886 Call hs_init_ghc() from your main() function to set these options.
24887C:\msys64\var\drydock\workingcopy-21838\repo\glasgow-haskell-compiler\inplace\mingw\bin\ar.exe: creating libraries/parallel/dist-install/build/libHSparallel-3.2.1.0.a
24888C:\msys64\var\drydock\workingcopy-21838\repo\glasgow-haskell-compiler\inplace\mingw\bin\ar.exe: creating libraries/random/dist-install/build/libHSrandom-1.1.a
24889
24890utils\haddock\haddock-api\src\Haddock\Convert.hs:37:31: error:
24891 Module ‘TysPrim’ does not export ‘unliftedTypeKindTyConName’
24892 |
2489337 | import TysPrim ( alphaTyVars, unliftedTypeKindTyConName )
24894 | ^^^^^^^^^^^^^^^^^^^^^^^^^
24895
24896utils\haddock\haddock-api\src\Haddock\Convert.hs:40:34: error:
24897 Module ‘PrelNames’ does not export ‘ptrRepLiftedDataConKey’
24898 |
2489940 | , tYPETyConKey, ptrRepLiftedDataConKey, ptrRepUnliftedDataConKey )
24900 | ^^^^^^^^^^^^^^^^^^^^^^
24901
24902utils\haddock\haddock-api\src\Haddock\Convert.hs:40:58: error:
24903 Module ‘PrelNames’ does not export ‘ptrRepUnliftedDataConKey’
24904 |
2490540 | , tYPETyConKey, ptrRepLiftedDataConKey, ptrRepUnliftedDataConKey )
24906 | ^^^^^^^^^^^^^^^^^^^^^^^^
24907make[1]: *** [utils/haddock/ghc.mk:21: utils/haddock/dist/build/Haddock/Convert.o] Error 1
24908make[1]: *** Waiting for unfinished jobs....
24909
24910utils\haddock\haddock-api\src\Haddock\Backends\LaTeX.hs:960:66: error:
24911 • Couldn't match type ‘GenLocated SrcSpan HsIPName’ with ‘HsIPName’
24912 Expected type: HsIPName
24913 Actual type: Located HsIPName
24914 • In the first argument of ‘ppIPName’, namely ‘n’
24915 In the first argument of ‘(<+>)’, namely ‘ppIPName n’
24916 In the first argument of ‘(<+>)’, namely ‘ppIPName n <+> dcolon u’
24917 |
24918960 | ppr_mono_ty _ (HsIParamTy n ty) u = brackets (ppIPName n <+> dcolon u <+> ppr_mono_lty pREC_TOP ty u)
24919 | ^
24920make[1]: *** [utils/haddock/ghc.mk:21: utils/haddock/dist/build/Haddock/Backends/LaTeX.o] Error 1
24921make: *** [Makefile:127: all] Error 2
24922

Build Log 148212 (remote - stdout)
25 - 50 - 100 - Unlimited Lines

7517 HC [stage 2] utils/mkUserGuidePart/dist/build/Options/Verbosity.o
7518 HC [stage 2] utils/mkUserGuidePart/dist/build/Options/TemporaryFiles.o
7519 HC [stage 2] utils/mkUserGuidePart/dist/build/Options/RedirectingOutput.o
7520 HC [stage 2] utils/mkUserGuidePart/dist/build/Options/RecompilationChecking.o
7521 HC [stage 2] utils/mkUserGuidePart/dist/build/Options/ProgramCoverage.o
7522 HC [stage 2] utils/mkUserGuidePart/dist/build/Options/Profiling.o
7523 HC [stage 2] utils/mkUserGuidePart/dist/build/Options/Plugin.o
7524 HC [stage 2] utils/mkUserGuidePart/dist/build/Options/PlatformSpecific.o
7525 HC [stage 2] utils/mkUserGuidePart/dist/build/Options/PhaseSpecific.o
7526 HC [stage 2] utils/mkUserGuidePart/dist/build/Options/PhasePrograms.o
7527 HC [stage 2] utils/mkUserGuidePart/dist/build/Options/Phases.o
7528 HC [stage 2] utils/mkUserGuidePart/dist/build/Options/Packages.o
7529 HC [stage 2] utils/mkUserGuidePart/dist/build/Options/OptimizationLevels.o
7530 HC [stage 2] utils/mkUserGuidePart/dist/build/Options/Optimizations.o
7531 HC [stage 2] utils/mkUserGuidePart/dist/build/Options/Modes.o
7532 HC [stage 2] utils/mkUserGuidePart/dist/build/Options/Misc.o
7533 HC [stage 2] utils/mkUserGuidePart/dist/build/Options/Linking.o
7534 HC [stage 2] utils/mkUserGuidePart/dist/build/Options/Language.o
7535 HC [stage 2] utils/mkUserGuidePart/dist/build/Options/KeepingIntermediates.o
7536 HC [stage 2] utils/mkUserGuidePart/dist/build/Options/InterfaceFiles.o
7537 HC [stage 2] utils/mkUserGuidePart/dist/build/Options/Interactive.o
7538 HC [stage 2] utils/mkUserGuidePart/dist/build/Options/FindingImports.o
7539 HC [stage 2] utils/mkUserGuidePart/dist/build/Options/Cpp.o
7540 HC [stage 2] utils/mkUserGuidePart/dist/build/Options/CompilerDebugging.o
7541 HC [stage 2] utils/mkUserGuidePart/dist/build/Options/CodeGen.o
7542 HC [stage 2] utils/mkUserGuidePart/dist/build/Table.o
7543 AR libraries/parallel/dist-install/build/libHSparallel-3.2.1.0.a
7544 LD libraries/parallel/dist-install/build/HSparallel-3.2.1.0.o
7545 HC [stage 2] utils/haddock/dist/build/Haddock/Utils.o
7546 HC [stage 2] utils/haddock/dist/build/Data/Attoparsec/Internal/Types.o
7547 HC [stage 2] utils/haddock/dist/build/Haddock/Interface/Rename.o
7548 HC [stage 2] utils/haddock/dist/build/Haddock/Interface/Specialize.o
7549 HC [stage 2] libraries/stm/dist-install/build/Control/Concurrent/STM.o
7550 HC [stage 2] utils/haddock/dist/build/Haddock/ModuleTree.o
7551 LD libraries/random/dist-install/build/HSrandom-1.1.o
7552 AR libraries/random/dist-install/build/libHSrandom-1.1.a
7553 HC [stage 2] utils/mkUserGuidePart/dist/build/Options.o
7554 HC [stage 2] utils/haddock/dist/build/Haddock/Options.o
7555 HC [stage 2] utils/haddock/dist/build/Haddock/InterfaceFile.o
7556 HC [stage 2] utils/haddock/dist/build/Data/Attoparsec/Internal.o
7557 HC [stage 2] utils/haddock/dist/build/Haddock/Backends/Xhtml/Utils.o
7558 HC [stage 2] utils/haddock/dist/build/Haddock/Backends/Hoogle.o
7559 HC [stage 2] utils/haddock/dist/build/Haddock/Doc.o
7560 HC [stage 2] libraries/stm/dist-install/build/Control/Concurrent/STM/TSem.o
7561 HC [stage 2] utils/mkUserGuidePart/dist/build/Main.o
7562 HC [stage 2] utils/haddock/dist/build/Data/Attoparsec/Combinator.o
7563 HC [stage 2] utils/haddock/dist/build/Haddock/Convert.o
7564 HC [stage 2] utils/haddock/dist/build/Haddock/Backends/Hyperlinker/Utils.o
7565 HC [stage 2] utils/haddock/dist/build/Haddock/Backends/LaTeX.o
7566

Drydock: Prepare tree

When
Completed at Jan 21 2017, 2:50 PM · Built for 12 s
Status
Passed
2 empty logs are hidden. Show all logs.

Lease Working Copy

When
Completed at Jan 21 2017, 2:50 PM · Built instantly
Status
Passed