Build 18806

Properties

Drydock: Build

When
Completed at Jan 21 2017, 3:38 PM · Built for 47 m, 42 s
Status
Failed

Build Log 148213 (remote - stderr)
25 - 50 - 100 - Unlimited Lines

24823 Simplifier bailing out after 4 iterations [10575, 1639, 328, 58]
24824 Size = {terms: 4,097, types: 10,321, coercions: 9,573}
24825WARNING: file compiler\stranal\WwLib.hs, line 777
24826 No absent value for MutVar# RealWorld (Maybe FastZString)
24827WARNING: file compiler\stranal\WwLib.hs, line 777
24828 No absent value for MutVar# RealWorld (Maybe FastZString)
24829WARNING: file compiler\simplCore\SimplCore.hs, line 666
24830 Simplifier bailing out after 4 iterations [279, 38, 1, 1]
24831 Size = {terms: 4,438, types: 10,483, coercions: 9,722}
24832WARNING: file compiler\stgSyn\CoreToStg.hs, line 287
24833 $fFunctorGHCi True False
24834WARNING: file compiler\simplCore\SimplCore.hs, line 666
24835 Simplifier bailing out after 4 iterations [1468, 129, 22, 25]
24836 Size = {terms: 1,549, types: 2,360, coercions: 473}
24837WARNING: file compiler\stranal\WwLib.hs, line 777
24838 No absent value for MutVar# RealWorld (Maybe FastZString)
24839WARNING: file compiler\specialise\Specialise.hs, line 1174
24840 Missed specialisation opportunity for $w$c<*>
24841 [] 2 [] 1 [0]
24842WARNING: file compiler\simplCore\OccurAnal.hs, line 67
24843 Glomming in GHCi.UI:
24844 [sXGB :->, sXLm :->, sY40 :->, sY4o :->, sY4s :->, sY4x :->,
24845 sY4G :->, sY4Q :->, sY4R :->, sY4S :->, sY4T :->, sY4U :->,
24846 sY4V :->, sY4W :->, sY4X :->, sY5v :->, sY5D :->, sY5E :->]
24847WARNING: file compiler\simplCore\SimplEnv.hs, line 506 karg_s17VG
24848WARNING: file compiler\simplCore\SimplCore.hs, line 666
24849 Simplifier bailing out after 4 iterations [122214, 10658, 3060, 403]
24850 Size = {terms: 37,466, types: 68,744, coercions: 62,726}
24851WARNING: file compiler\simplCore\SimplCore.hs, line 666
24852 Simplifier bailing out after 4 iterations [7261, 374, 249, 21]
24853 Size = {terms: 36,415, types: 67,739, coercions: 54,669}
24854WARNING: file compiler\simplCore\SimplCore.hs, line 666
24855 Simplifier bailing out after 4 iterations [6283, 1293, 69, 73]
24856 Size = {terms: 41,137, types: 75,976, coercions: 55,118}
24857WARNING: file compiler\simplCore\SimplCore.hs, line 666
24858 Simplifier bailing out after 4 iterations [1262, 2450, 87, 19]
24859 Size = {terms: 40,300, types: 72,556, coercions: 45,085}
24860WARNING: file compiler\stranal\WwLib.hs, line 777
24861 No absent value for MutVar# RealWorld (Maybe FastZString)
24862WARNING: file compiler\stranal\WwLib.hs, line 777
24863 No absent value for State# RealWorld
24864WARNING: file compiler\stranal\WwLib.hs, line 777
24865 No absent value for MutVar# RealWorld (Maybe FastZString)
24866WARNING: file compiler\stranal\WwLib.hs, line 777
24867 No absent value for MutVar# RealWorld (Maybe FastZString)
24868WARNING: file compiler\stranal\WwLib.hs, line 777
24869 No absent value for MutVar# RealWorld (Maybe FastZString)
24870WARNING: file compiler\stranal\WwLib.hs, line 777
24871 No absent value for MutVar# RealWorld (Maybe FastZString)
24872WARNING: file compiler\stranal\WwLib.hs, line 777
24873 No absent value for State# RealWorld
24874WARNING: file compiler\stranal\WwLib.hs, line 777
24875 No absent value for State# RealWorld
24876WARNING: file compiler\simplCore\SimplCore.hs, line 666
24877 Simplifier bailing out after 4 iterations [4288, 64, 13, 4]
24878 Size = {terms: 40,407, types: 71,629, coercions: 45,113}
24879WARNING: file compiler\simplCore\OccurAnal.hs, line 67
24880 Glomming in Main: [srlF :->, srmU :-> OnceL!]
24881WARNING: file compiler\simplCore\SimplCore.hs, line 666
24882 Simplifier bailing out after 4 iterations [6107, 676, 56, 23]
24883 Size = {terms: 6,319, types: 10,232, coercions: 1,712}
24884WARNING: file compiler\main\TidyPgm.hs, line 1254 lvl_sF69
24885Warning: -rtsopts and -with-rtsopts have no effect with -no-hs-main.
24886 Call hs_init_ghc() from your main() function to set these options.
24887C:\msys64\var\drydock\workingcopy-21838\repo\glasgow-haskell-compiler\inplace\mingw\bin\ar.exe: creating libraries/parallel/dist-install/build/libHSparallel-3.2.1.0.a
24888C:\msys64\var\drydock\workingcopy-21838\repo\glasgow-haskell-compiler\inplace\mingw\bin\ar.exe: creating libraries/random/dist-install/build/libHSrandom-1.1.a
24889
24890utils\haddock\haddock-api\src\Haddock\Convert.hs:37:31: error:
24891 Module ‘TysPrim’ does not export ‘unliftedTypeKindTyConName’
24892 |
2489337 | import TysPrim ( alphaTyVars, unliftedTypeKindTyConName )
24894 | ^^^^^^^^^^^^^^^^^^^^^^^^^
24895
24896utils\haddock\haddock-api\src\Haddock\Convert.hs:40:34: error:
24897 Module ‘PrelNames’ does not export ‘ptrRepLiftedDataConKey’
24898 |
2489940 | , tYPETyConKey, ptrRepLiftedDataConKey, ptrRepUnliftedDataConKey )
24900 | ^^^^^^^^^^^^^^^^^^^^^^
24901
24902utils\haddock\haddock-api\src\Haddock\Convert.hs:40:58: error:
24903 Module ‘PrelNames’ does not export ‘ptrRepUnliftedDataConKey’
24904 |
2490540 | , tYPETyConKey, ptrRepLiftedDataConKey, ptrRepUnliftedDataConKey )
24906 | ^^^^^^^^^^^^^^^^^^^^^^^^
24907make[1]: *** [utils/haddock/ghc.mk:21: utils/haddock/dist/build/Haddock/Convert.o] Error 1
24908make[1]: *** Waiting for unfinished jobs....
24909
24910utils\haddock\haddock-api\src\Haddock\Backends\LaTeX.hs:960:66: error:
24911 • Couldn't match type ‘GenLocated SrcSpan HsIPName’ with ‘HsIPName’
24912 Expected type: HsIPName
24913 Actual type: Located HsIPName
24914 • In the first argument of ‘ppIPName’, namely ‘n’
24915 In the first argument of ‘(<+>)’, namely ‘ppIPName n’
24916 In the first argument of ‘(<+>)’, namely ‘ppIPName n <+> dcolon u’
24917 |
24918960 | ppr_mono_ty _ (HsIParamTy n ty) u = brackets (ppIPName n <+> dcolon u <+> ppr_mono_lty pREC_TOP ty u)
24919 | ^
24920make[1]: *** [utils/haddock/ghc.mk:21: utils/haddock/dist/build/Haddock/Backends/LaTeX.o] Error 1
24921make: *** [Makefile:127: all] Error 2
24922

Build Log 148212 (remote - stdout)
25 - 50 - 100 - Unlimited Lines

7467 [RHS of $w$srandomRFloating_sdGa :: Float#
7468 -> Float# -> StdGen -> (# Float, StdGen #)]
7469 INLINE binder is (non-rule) loop breaker: $w$srandomRFloating_sdGa
7470libraries\random\System\Random.hs:403:1: warning:
7471 [RHS of $w$srandomRFloating_sdHc :: Double#
7472 -> Double# -> StdGen -> (# CDouble, StdGen #)]
7473 INLINE binder is (non-rule) loop breaker: $w$srandomRFloating_sdHc
7474libraries\random\System\Random.hs:403:1: warning:
7475 [RHS of $wrandomRFloating_sdHv :: forall a g.
7476 (Fractional a, Ord a, Random a, RandomGen g) =>
7477 a -> a -> g -> (# a, g #)]
7478 INLINE binder is (non-rule) loop breaker: $wrandomRFloating_sdHv
7479
7480*** Core Lint warnings : in result of Tidy Core ***
7481libraries\random\System\Random.hs:403:1: warning:
7482 [RHS of $w$srandomRFloating2 :: Double#
7483 -> Double# -> StdGen -> (# Double, StdGen #)]
7484 INLINE binder is (non-rule) loop breaker: $w$srandomRFloating2
7485libraries\random\System\Random.hs:403:1: warning:
7486 [RHS of $w$srandomRFloating1 :: Float#
7487 -> Float# -> StdGen -> (# CFloat, StdGen #)]
7488 INLINE binder is (non-rule) loop breaker: $w$srandomRFloating1
7489libraries\random\System\Random.hs:403:1: warning:
7490 [RHS of $w$srandomRFloating3 :: Float#
7491 -> Float# -> StdGen -> (# Float, StdGen #)]
7492 INLINE binder is (non-rule) loop breaker: $w$srandomRFloating3
7493libraries\random\System\Random.hs:403:1: warning:
7494 [RHS of $w$srandomRFloating :: Double#
7495 -> Double# -> StdGen -> (# CDouble, StdGen #)]
7496 INLINE binder is (non-rule) loop breaker: $w$srandomRFloating
7497
7498*** Core Lint warnings : in result of CorePrep ***
7499libraries\random\System\Random.hs:403:1: warning:
7500 [RHS of $w$srandomRFloating2 :: Double#
7501 -> Double# -> StdGen -> (# Double, StdGen #)]
7502 INLINE binder is (non-rule) loop breaker: $w$srandomRFloating2
7503libraries\random\System\Random.hs:403:1: warning:
7504 [RHS of $w$srandomRFloating1 :: Float#
7505 -> Float# -> StdGen -> (# CFloat, StdGen #)]
7506 INLINE binder is (non-rule) loop breaker: $w$srandomRFloating1
7507libraries\random\System\Random.hs:403:1: warning:
7508 [RHS of $w$srandomRFloating3 :: Float#
7509 -> Float# -> StdGen -> (# Float, StdGen #)]
7510 INLINE binder is (non-rule) loop breaker: $w$srandomRFloating3
7511libraries\random\System\Random.hs:403:1: warning:
7512 [RHS of $w$srandomRFloating :: Double#
7513 -> Double# -> StdGen -> (# CDouble, StdGen #)]
7514 INLINE binder is (non-rule) loop breaker: $w$srandomRFloating
7515
7516 HC [stage 2] utils/mkUserGuidePart/dist/build/Options/Warnings.o
7517 HC [stage 2] utils/mkUserGuidePart/dist/build/Options/Verbosity.o
7518 HC [stage 2] utils/mkUserGuidePart/dist/build/Options/TemporaryFiles.o
7519 HC [stage 2] utils/mkUserGuidePart/dist/build/Options/RedirectingOutput.o
7520 HC [stage 2] utils/mkUserGuidePart/dist/build/Options/RecompilationChecking.o
7521 HC [stage 2] utils/mkUserGuidePart/dist/build/Options/ProgramCoverage.o
7522 HC [stage 2] utils/mkUserGuidePart/dist/build/Options/Profiling.o
7523 HC [stage 2] utils/mkUserGuidePart/dist/build/Options/Plugin.o
7524 HC [stage 2] utils/mkUserGuidePart/dist/build/Options/PlatformSpecific.o
7525 HC [stage 2] utils/mkUserGuidePart/dist/build/Options/PhaseSpecific.o
7526 HC [stage 2] utils/mkUserGuidePart/dist/build/Options/PhasePrograms.o
7527 HC [stage 2] utils/mkUserGuidePart/dist/build/Options/Phases.o
7528 HC [stage 2] utils/mkUserGuidePart/dist/build/Options/Packages.o
7529 HC [stage 2] utils/mkUserGuidePart/dist/build/Options/OptimizationLevels.o
7530 HC [stage 2] utils/mkUserGuidePart/dist/build/Options/Optimizations.o
7531 HC [stage 2] utils/mkUserGuidePart/dist/build/Options/Modes.o
7532 HC [stage 2] utils/mkUserGuidePart/dist/build/Options/Misc.o
7533 HC [stage 2] utils/mkUserGuidePart/dist/build/Options/Linking.o
7534 HC [stage 2] utils/mkUserGuidePart/dist/build/Options/Language.o
7535 HC [stage 2] utils/mkUserGuidePart/dist/build/Options/KeepingIntermediates.o
7536 HC [stage 2] utils/mkUserGuidePart/dist/build/Options/InterfaceFiles.o
7537 HC [stage 2] utils/mkUserGuidePart/dist/build/Options/Interactive.o
7538 HC [stage 2] utils/mkUserGuidePart/dist/build/Options/FindingImports.o
7539 HC [stage 2] utils/mkUserGuidePart/dist/build/Options/Cpp.o
7540 HC [stage 2] utils/mkUserGuidePart/dist/build/Options/CompilerDebugging.o
7541 HC [stage 2] utils/mkUserGuidePart/dist/build/Options/CodeGen.o
7542 HC [stage 2] utils/mkUserGuidePart/dist/build/Table.o
7543 AR libraries/parallel/dist-install/build/libHSparallel-3.2.1.0.a
7544 LD libraries/parallel/dist-install/build/HSparallel-3.2.1.0.o
7545 HC [stage 2] utils/haddock/dist/build/Haddock/Utils.o
7546 HC [stage 2] utils/haddock/dist/build/Data/Attoparsec/Internal/Types.o
7547 HC [stage 2] utils/haddock/dist/build/Haddock/Interface/Rename.o
7548 HC [stage 2] utils/haddock/dist/build/Haddock/Interface/Specialize.o
7549 HC [stage 2] libraries/stm/dist-install/build/Control/Concurrent/STM.o
7550 HC [stage 2] utils/haddock/dist/build/Haddock/ModuleTree.o
7551 LD libraries/random/dist-install/build/HSrandom-1.1.o
7552 AR libraries/random/dist-install/build/libHSrandom-1.1.a
7553 HC [stage 2] utils/mkUserGuidePart/dist/build/Options.o
7554 HC [stage 2] utils/haddock/dist/build/Haddock/Options.o
7555 HC [stage 2] utils/haddock/dist/build/Haddock/InterfaceFile.o
7556 HC [stage 2] utils/haddock/dist/build/Data/Attoparsec/Internal.o
7557 HC [stage 2] utils/haddock/dist/build/Haddock/Backends/Xhtml/Utils.o
7558 HC [stage 2] utils/haddock/dist/build/Haddock/Backends/Hoogle.o
7559 HC [stage 2] utils/haddock/dist/build/Haddock/Doc.o
7560 HC [stage 2] libraries/stm/dist-install/build/Control/Concurrent/STM/TSem.o
7561 HC [stage 2] utils/mkUserGuidePart/dist/build/Main.o
7562 HC [stage 2] utils/haddock/dist/build/Data/Attoparsec/Combinator.o
7563 HC [stage 2] utils/haddock/dist/build/Haddock/Convert.o
7564 HC [stage 2] utils/haddock/dist/build/Haddock/Backends/Hyperlinker/Utils.o
7565 HC [stage 2] utils/haddock/dist/build/Haddock/Backends/LaTeX.o
7566

Drydock: Prepare tree

When
Completed at Jan 21 2017, 2:50 PM · Built for 12 s
Status
Passed
2 empty logs are hidden. Show all logs.

Lease Working Copy

When
Completed at Jan 21 2017, 2:50 PM · Built instantly
Status
Passed