Build 18806

Properties

Drydock: Build

When
Completed at Jan 21 2017, 3:38 PM · Built for 47 m, 42 s
Status
Failed

Build Log 148213 (remote - stderr)
25 - 50 - 100 - Unlimited Lines

24898 |
2489940 | , tYPETyConKey, ptrRepLiftedDataConKey, ptrRepUnliftedDataConKey )
24900 | ^^^^^^^^^^^^^^^^^^^^^^
24901
24902utils\haddock\haddock-api\src\Haddock\Convert.hs:40:58: error:
24903 Module ‘PrelNames’ does not export ‘ptrRepUnliftedDataConKey’
24904 |
2490540 | , tYPETyConKey, ptrRepLiftedDataConKey, ptrRepUnliftedDataConKey )
24906 | ^^^^^^^^^^^^^^^^^^^^^^^^
24907make[1]: *** [utils/haddock/ghc.mk:21: utils/haddock/dist/build/Haddock/Convert.o] Error 1
24908make[1]: *** Waiting for unfinished jobs....
24909
24910utils\haddock\haddock-api\src\Haddock\Backends\LaTeX.hs:960:66: error:
24911 • Couldn't match type ‘GenLocated SrcSpan HsIPName’ with ‘HsIPName’
24912 Expected type: HsIPName
24913 Actual type: Located HsIPName
24914 • In the first argument of ‘ppIPName’, namely ‘n’
24915 In the first argument of ‘(<+>)’, namely ‘ppIPName n’
24916 In the first argument of ‘(<+>)’, namely ‘ppIPName n <+> dcolon u’
24917 |
24918960 | ppr_mono_ty _ (HsIParamTy n ty) u = brackets (ppIPName n <+> dcolon u <+> ppr_mono_lty pREC_TOP ty u)
24919 | ^
24920make[1]: *** [utils/haddock/ghc.mk:21: utils/haddock/dist/build/Haddock/Backends/LaTeX.o] Error 1
24921make: *** [Makefile:127: all] Error 2
24922

Build Log 148212 (remote - stdout)
25 - 50 - 100 - Unlimited Lines

7542 HC [stage 2] utils/mkUserGuidePart/dist/build/Table.o
7543 AR libraries/parallel/dist-install/build/libHSparallel-3.2.1.0.a
7544 LD libraries/parallel/dist-install/build/HSparallel-3.2.1.0.o
7545 HC [stage 2] utils/haddock/dist/build/Haddock/Utils.o
7546 HC [stage 2] utils/haddock/dist/build/Data/Attoparsec/Internal/Types.o
7547 HC [stage 2] utils/haddock/dist/build/Haddock/Interface/Rename.o
7548 HC [stage 2] utils/haddock/dist/build/Haddock/Interface/Specialize.o
7549 HC [stage 2] libraries/stm/dist-install/build/Control/Concurrent/STM.o
7550 HC [stage 2] utils/haddock/dist/build/Haddock/ModuleTree.o
7551 LD libraries/random/dist-install/build/HSrandom-1.1.o
7552 AR libraries/random/dist-install/build/libHSrandom-1.1.a
7553 HC [stage 2] utils/mkUserGuidePart/dist/build/Options.o
7554 HC [stage 2] utils/haddock/dist/build/Haddock/Options.o
7555 HC [stage 2] utils/haddock/dist/build/Haddock/InterfaceFile.o
7556 HC [stage 2] utils/haddock/dist/build/Data/Attoparsec/Internal.o
7557 HC [stage 2] utils/haddock/dist/build/Haddock/Backends/Xhtml/Utils.o
7558 HC [stage 2] utils/haddock/dist/build/Haddock/Backends/Hoogle.o
7559 HC [stage 2] utils/haddock/dist/build/Haddock/Doc.o
7560 HC [stage 2] libraries/stm/dist-install/build/Control/Concurrent/STM/TSem.o
7561 HC [stage 2] utils/mkUserGuidePart/dist/build/Main.o
7562 HC [stage 2] utils/haddock/dist/build/Data/Attoparsec/Combinator.o
7563 HC [stage 2] utils/haddock/dist/build/Haddock/Convert.o
7564 HC [stage 2] utils/haddock/dist/build/Haddock/Backends/Hyperlinker/Utils.o
7565 HC [stage 2] utils/haddock/dist/build/Haddock/Backends/LaTeX.o
7566

Drydock: Prepare tree

When
Completed at Jan 21 2017, 2:50 PM · Built for 12 s
Status
Passed
2 empty logs are hidden. Show all logs.

Lease Working Copy

When
Completed at Jan 21 2017, 2:50 PM · Built instantly
Status
Passed