Build 18788

Properties

Drydock: Build

When
Completed at Jan 21 2017, 10:35 AM · Built for 24 m, 25 s
Status
Failed
Description

Run patch builds.

Build Log 148101 (remote - stderr)
25 - 50 - 100 - Unlimited Lines

25676960 | ppr_mono_ty _ (HsIParamTy n ty) u = brackets (ppIPName n <+> dcolon u <+> ppr_mono_lty pREC_TOP ty u)
25677 | ^
25678make[1]: *** [utils/haddock/dist/build/Haddock/Backends/LaTeX.dyn_o] Error 1
25679make[1]: *** Waiting for unfinished jobs....
25680
25681utils/haddock/haddock-api/src/Haddock/Convert.hs:37:31: error:
25682 Module ‘TysPrim’ does not export ‘unliftedTypeKindTyConName’
25683 |
2568437 | import TysPrim ( alphaTyVars, unliftedTypeKindTyConName )
25685 | ^^^^^^^^^^^^^^^^^^^^^^^^^
25686
25687utils/haddock/haddock-api/src/Haddock/Convert.hs:40:34: error:
25688 Module ‘PrelNames’ does not export ‘ptrRepLiftedDataConKey’
25689 |
2569040 | , tYPETyConKey, ptrRepLiftedDataConKey, ptrRepUnliftedDataConKey )
25691 | ^^^^^^^^^^^^^^^^^^^^^^
25692
25693utils/haddock/haddock-api/src/Haddock/Convert.hs:40:58: error:
25694 Module ‘PrelNames’ does not export ‘ptrRepUnliftedDataConKey’
25695 |
2569640 | , tYPETyConKey, ptrRepLiftedDataConKey, ptrRepUnliftedDataConKey )
25697 | ^^^^^^^^^^^^^^^^^^^^^^^^
25698make[1]: *** [utils/haddock/dist/build/Haddock/Convert.dyn_o] Error 1
25699make: *** [all] Error 2
25700

Build Log 148100 (remote - stdout)
25 - 50 - 100 - Unlimited Lines

6833 -> Float# -> StdGen -> (# Float, StdGen #)]
6834 INLINE binder is (non-rule) loop breaker: $w$srandomRFloating3
6835libraries/random/System/Random.hs:403:1: warning:
6836 [RHS of $w$srandomRFloating :: Double#
6837 -> Double# -> StdGen -> (# CDouble, StdGen #)]
6838 INLINE binder is (non-rule) loop breaker: $w$srandomRFloating
6839
6840 HC [stage 2] utils/mkUserGuidePart/dist/build/Main.dyn_o
6841 HC [stage 2] utils/haddock/dist/build/Haddock/Options.dyn_o
6842 HC [stage 2] utils/haddock/dist/build/Haddock/InterfaceFile.dyn_o
6843 HC [stage 2] utils/haddock/dist/build/Haddock/Backends/Xhtml/Utils.dyn_o
6844 HC [stage 2] utils/haddock/dist/build/Haddock/Backends/Hoogle.dyn_o
6845 HC [stage 2] utils/haddock/dist/build/Haddock/Doc.dyn_o
6846 AR libraries/stm/dist-install/build/libHSstm-2.4.4.1.a
6847 AR libraries/random/dist-install/build/libHSrandom-1.1.a
6848 HC [stage 2] utils/mkUserGuidePart/dist/build/tmp/mkUserGuidePart
6849 HC [stage 2] utils/haddock/dist/build/Data/Attoparsec/Combinator.dyn_o
6850 HC [stage 2] utils/haddock/dist/build/Haddock/Backends/Hyperlinker/Utils.dyn_o
6851 HC [stage 2] utils/haddock/dist/build/Haddock/Backends/LaTeX.dyn_o
6852 HC [stage 2] utils/haddock/dist/build/Haddock/Backends/Xhtml/Names.dyn_o
6853 HC [stage 2] libraries/stm/dist-install/build/libHSstm-2.4.4.1-ghc8.1.20170121.so
6854 HC [stage 2] libraries/random/dist-install/build/libHSrandom-1.1-ghc8.1.20170121.so
6855 HC [stage 2] utils/haddock/dist/build/Data/Attoparsec/ByteString/Internal.dyn_o
6856 HC [stage 2] utils/haddock/dist/build/Haddock/Convert.dyn_o
6857

Drydock: Prepare tree

When
Completed at Jan 21 2017, 10:11 AM · Built for 2 s
Status
Passed
1 empty logs are hidden. Show all logs.

Build Log 148098 (remote - stdout)
25 - 50 - 100 - Unlimited Lines

1Submodule path 'libraries/Cabal': checked out '09865f60caa55a7b02880f2a779c9dd8e1be5ac0'
2Submodule path 'utils/haddock': checked out 'b34497c36cd01a9c8a08ec3133ec94783642e43d'
3

Lease Working Copy

When
Completed at Jan 21 2017, 10:11 AM · Built instantly
Status
Passed
Description

Lease a working copy for amd64 builds.