Build 11545

Drydock: Run Command

This build step has since been deleted on the build plan. Some information may be omitted.
When
Completed at May 10 2016, 3:36 AM · Built for 1 m, 35 s
Status
Failed

Build Log 124658 (remote - stderr)
25 - 50 - 100 - Unlimited Lines

644libraries/hoopl/ghc.mk:3: libraries/hoopl/dist-boot/build/.depend-v.c_asm: No such file or directory
645libraries/transformers/ghc.mk:3: libraries/transformers/dist-boot/build/.depend-v.haskell: No such file or directory
646libraries/transformers/ghc.mk:3: libraries/transformers/dist-boot/build/.depend-v.c_asm: No such file or directory
647libraries/terminfo/ghc.mk:3: libraries/terminfo/dist-boot/build/.depend-v.haskell: No such file or directory
648libraries/terminfo/ghc.mk:3: libraries/terminfo/dist-boot/build/.depend-v.c_asm: No such file or directory
649compiler/ghc.mk:570: compiler/stage1/build/.depend-v.haskell: No such file or directory
650compiler/ghc.mk:570: compiler/stage1/build/.depend-v.c_asm: No such file or directory
651utils/ghc-pkg/ghc.mk:60: utils/ghc-pkg/dist/build/.depend.haskell: No such file or directory
652utils/ghc-pkg/ghc.mk:60: utils/ghc-pkg/dist/build/.depend.c_asm: No such file or directory
653utils/dll-split/ghc.mk:23: utils/dll-split/dist-install/build/.depend.haskell: No such file or directory
654utils/dll-split/ghc.mk:23: utils/dll-split/dist-install/build/.depend.c_asm: No such file or directory
655ghc/ghc.mk:111: ghc/stage1/build/.depend.haskell: No such file or directory
656ghc/ghc.mk:111: ghc/stage1/build/.depend.c_asm: No such file or directory
657In file included from includes/Stg.h:213:0,
658 from includes/Rts.h:30,
659 from includes/dist-derivedconstants/header/tmp.c:13:
660includes/stg/Types.h:31:2: error: #import is a deprecated GCC extension [-Werror=deprecated]
661 #import <inttypes.h>
662 ^
663cc1: all warnings being treated as errors
664Executing "gcc" failed
665make[1]: *** [includes/dist-derivedconstants/header/DerivedConstants.h] Error 1
666make[1]: *** Waiting for unfinished jobs....
667make: *** [all] Error 2
668

Build Log 124657 (remote - stdout)
25 - 50 - 100 - Unlimited Lines

571Creating compiler/stage1/ghc_boot_platform.h...
572 ALEX compiler/stage1/build/CmmLex.hs
573 HAPPY compiler/stage1/build/CmmParse.hs
574 ALEX compiler/stage1/build/Lexer.hs
575 HAPPY compiler/stage1/build/Parser.hs
576 HC [stage 0] utils/hsc2hs/dist/build/HSCParser.o
577 HC [stage 0] utils/hsc2hs/dist/build/Flags.o
578 HC [stage 0] utils/hsc2hs/dist/build/Common.o
579 HC [stage 0] utils/hsc2hs/dist/build/Paths_hsc2hs.o
580 HC [stage 0] utils/deriveConstants/dist/build/Main.o
581Creating includes/ghcversion.h...
582 HC [stage 0] utils/genprimopcode/dist/build/Syntax.o
583 HC [stage 0] utils/genprimopcode/dist/build/ParserM.o
584Done.
585Done.
586 HC [stage 0] utils/hsc2hs/dist/build/C.o
587 HC [stage 0] utils/genprimopcode/dist/build/Lexer.o
588 HC [stage 0] utils/hsc2hs/dist/build/CrossCodegen.o
589 HC [stage 0] utils/hsc2hs/dist/build/UtilsCodegen.o
590 HC [stage 0] utils/deriveConstants/dist/build/tmp/deriveConstants
591 HC [stage 0] utils/genprimopcode/dist/build/Parser.o
592 HC [stage 0] utils/hsc2hs/dist/build/DirectCodegen.o
593 HC [stage 0] utils/genprimopcode/dist/build/Main.o
594 HC [stage 0] utils/hsc2hs/dist/build/Main.o
595

Build Working Copy

When
Completed at May 10 2016, 3:34 AM · Built instantly
Status
Passed
Description

Lease a working copy for Linux/amd64 builds.